{"text_format":"1","workbook":"xlsx","n_sheets":4,"sheets":["Кэфы","Выгрузка с сайта","Выгрузка","Вычисления"],"not_rendered":{"charts":0,"images":1,"macros":1,"external_links":0,"defined_names":2,"comments":0,"pivot_tables":0},"unopened":[],"bounds":{"document_bytes":16777216,"sheet_cells":100000,"rows_first":2000,"rows_last":500,"rows_between":2000,"halvings":0,"cell_chars":16384,"cell_head_chars":4096},"cells_cut":0,"cells_raw":0,"read":"whole","date_system":"1900"}

{"sheet":"Кэфы","index":0,"n_rows":25,"n_cols":6,"rows_kept":25,"cut":false,"hidden":false,"merged":[[15,1,18,5]]}
[]
[]
[]
[null,"До следующего обновления цен на рыбу осталось:",null,null,{"$f":"HOUR(TEXT(IF(TEXT(MID(INDEX(Выгрузка!$A:$A,MATCH(\"Последнее изменение цен было в *\",Выгрузка!$A:$A,0),1),32,5)*1+5/24,\"ч:мм\")*1-(NOW()-TODAY())<0, TEXT(MID(INDEX(Выгрузка!$A:$A,MATCH(\"Последнее изменение цен было в *\",Выгрузка!$A:$A,0),1),32,5)*1+5/24,\"ч:мм\")*1-(NOW()-TODAY())+1,TEXT(MID(INDEX(Выгрузка!$A:$A,MATCH(\"Последнее изменение цен было в *\",Выгрузка!$A:$A,0),1),32,5)*1+5/24,\"ч:мм\")*1-(NOW()-TODAY())),\"ч:мм\"))&\"ч \"&MINUTE(TEXT(IF(TEXT(MID(INDEX(Выгрузка!$A:$A,MATCH(\"Последнее изменение цен было в *\",Выгрузка!$A:$A,0),1),32,5)*1+5/24,\"ч:мм\")*1-(NOW()-TODAY())<0, TEXT(MID(INDEX(Выгрузка!$A:$A,MATCH(\"Последнее изменение цен было в *\",Выгрузка!$A:$A,0),1),32,5)*1+5/24,\"ч:мм\")*1-(NOW()-TODAY())+1,TEXT(MID(INDEX(Выгрузка!$A:$A,MATCH(\"Последнее изменение цен было в *\",Выгрузка!$A:$A,0),1),32,5)*1+5/24,\"ч:мм\")*1-(NOW()-TODAY())),\"ч:мм\"))&\"мин\"","v":"1ч 36мин"},"реального времени"]
[]
[null,"Кит","Шт.","Текущий кэф","Макс. кэф","% от макс.*"]
[null,"Кашалот",{"$f":"INDEX(Вычисления!$1:$1048576,MATCH($B7,Вычисления!$A:$A,0)-2,5)","v":339},{"$f":"IF(C7<=10, \"Баг с ценой\", VLOOKUP(B7,Вычисления!$A:$E,5,0))","v":1.0364180984388829},1.0446149106116156,{"$f":"IF(D7=\"Баг с ценой\", \"Не продавай!\",D7/E7)","v":0.99215326902816892}]
[null,"Кит горбатый",{"$f":"INDEX(Вычисления!$1:$1048576,MATCH($B8,Вычисления!$A:$A,0)-2,5)","v":54},{"$f":"IF(C8<=10, \"Баг с ценой\", VLOOKUP(B8,Вычисления!$A:$E,5,0))","v":1.0957664364296154},1.0965083682400059,{"$f":"IF(D8=\"Баг с ценой\", \"Не продавай!\",D8/E8)","v":0.99932336876591155}]
[null,"Кит горбатый-альбинос",{"$f":"INDEX(Вычисления!$1:$1048576,MATCH($B9,Вычисления!$A:$A,0)-2,5)","v":28},{"$f":"IF(C9<=10, \"Баг с ценой\", VLOOKUP(B9,Вычисления!$A:$E,5,0))","v":1.7316695230511308},1.7322076348486417,0.99968934913650931]
[null,"Кит синий северный",{"$f":"INDEX(Вычисления!$1:$1048576,MATCH($B10,Вычисления!$A:$A,0)-2,5)","v":7},{"$f":"IF(C10<=10, \"Баг с ценой\", VLOOKUP(B10,Вычисления!$A:$E,5,0))","v":"Баг с ценой"},1.4433169154018517,"Не продавай!"]
[null,"Кит серый",{"$f":"INDEX(Вычисления!$1:$1048576,MATCH($B11,Вычисления!$A:$A,0)-2,5)","v":8},{"$f":"IF(C11<=10, \"Баг с ценой\", VLOOKUP(B11,Вычисления!$A:$E,5,0))","v":"Баг с ценой"},0.952566527000136,"Не продавай!"]
[null,"Кит японский",{"$f":"INDEX(Вычисления!$1:$1048576,MATCH($B12,Вычисления!$A:$A,0)-2,5)","v":0},{"$f":"IF(C12<=10, \"Баг с ценой\", VLOOKUP(B12,Вычисления!$A:$E,5,0))","v":"Баг с ценой"},2.1655516836404356,"Не продавай!"]
[null,"Сейвал или кит ивасевый",{"$f":"INDEX(Вычисления!$1:$1048576,MATCH($B13,Вычисления!$A:$A,0)-2,5)","v":211},{"$f":"IF(C13<=10, \"Баг с ценой\", VLOOKUP(B13,Вычисления!$A:$E,5,0))","v":0.61311571647253904},0.61385984162205964,0.99878779307739962]
[null,"Финвал",{"$f":"INDEX(Вычисления!$1:$1048576,MATCH($B14,Вычисления!$A:$A,0)-2,5)","v":22845},{"$f":"IF(C14<=10, \"Баг с ценой\", VLOOKUP(B14,Вычисления!$A:$E,5,0))","v":0.21542205841613671},0.92696141974044077,0.23239592698092787]
[]
[null,"* Показывает в %, насколько текущая цена велика в сравнении с максимальной известной мне. Условные обозначения в виде стрелок и соответствующие значения описаны под таблицей. Изучи их и прими решение о продаже самостоятельно или в соответствии с рекомендациями."]
[]
[]
[]
[]
[null,"[98% - 100%] Смело продавай, прекрасная цена"]
[null,"[95% - 98%] Тоже отличная цена, но нередко бывает лучше"]
[null,"[90% - 95%] Средняя цена. Лучше придержи и продай позже"]
[null,"[80% - 90%] Плохая цена. Продавай, только если срочно нужны деньги"]
[null,"Ниже 80% Рыба не в цене. Ни в коем случае не продавай"]

{"sheet":"Выгрузка с сайта","index":1,"n_rows":1357,"n_cols":5,"rows_kept":1357,"cut":false,"hidden":true,"merged":[]}
["Место:","Рыба:","Рыба:2","Прогресс:","Продано (шт):"]
[1,"","Косаткодельфин","",0]
[2,"","Морская свинья бесперая","",0]
[3,"","Рыба луна короткая","",0]
[4,"","Манта рифовая","",0]
[5,"","Рыба-луна овальная","",0]
[6,"","Сельдь чёшско-печорская","",0]
[7,"","Сельдь волжская","",0]
[8,"","Менхэден бразильский","",0]
[9,"","Бэрардиус Бэрда","",0]
[10,"","Акула мозамбикская бычья","",0]
[11,"","Кит синий альбинос","",0]
[12,"","Группер Малабарский","",0]
[13,"","Осьминог Думбо","",0]
[14,"","Кит японский","",0]
[16,"","Антимора  клюворылая","",0]
[17,"","Косатка малая","",0]
[19,"","Афалина","",0]
[20,"","Ремнезуб командорский","",0]
[21,"","Пузанок северокаспийский","",0]
[22,"","Рыба-тряпка","",0]
[23,"","Чешуйчатник","",0]
[24,"","Семапрохилодус","",0]
[25,"","Морская свинья обыкновенная","",0]
[26,"","Эолидия","",0]
[30,"","Кланкулюс","",0]
[31,"","Граммистес шестиполосый","",0]
[33,"","Форель Бива","",0]
[34,"","Вьюн амурский","",0]
[35,"","Сельдь тихоокеанская","",0]
[36,"","Сельдь атлантическая","",0]
[37,"","Кит южный гладкий","",0]
[38,"","Каранкс бронзовый","",0]
[39,"","Кинжалозуб","",0]
[40,"","Полосатик Омуры","",0]
[41,"","Каранкс Гебера","",0]
[43,"","Кижуч озерный","",0]
[44,"","Голец носатый","",0]
[47,"","Форель остроголовая","",0]
[49,"","Осетр тихоокеанский","",0]
[52,"","Рыба-ремень, сельдяной король","",0]
[53,"","Катран вануатский","",0]
[54,"","Краб-йети","",0]
[55,"","Акулеола черная","",0]
[56,"","Акула черная (Далатия)","",0]
[57,"","Хирург-Ахиллес","",0]
[58,"","Мегалодон","",0]
[59,"","Мешкорот","",0]
[60,"","Багре хигучи","",0]
[61,"","Акула эполетовая","",0]
[62,"","Акула губастая","",0]
[63,"","Пилонос японский","",0]
[64,"","Плиотрема","",0]
[65,"","Австралийский пилонос","",0]
[66,"","Минога сибирская","",0]
[67,"","Палтус американский","",0]
[68,"","Центрина Австралийская","",0]
[70,"","Хвостокол кольчатый","",0]
[71,"","Сарпа","",0]
[72,"","Форель Дональдсона","",0]
[73,"","Акула сигарная","",0]
[74,"","Акула скульптурная","",0]
[75,"","Акула - свинья","",0]
[77,"","Акула светлохвостая","",0]
[78,"","Лихия","",0]
[79,"","Маллисквама","",0]
[80,"","Камбала двухцветная","",0]
[81,"","Акула шершавая","",0]
[82,"","Калкан черноморский","",0]
[91,"","Лягушка нильская","",0]
[92,"","Мелания песчаная","",0]
[94,"","Карась-барабан","",0]
[95,"","Шипощёк длинноперый","",0]
[96,"","Рыба-кабан трехполосая","",0]
[97,"","Удильщик Джонсона","",0]
[100,"","Скат-орляк пятнистый","",0]
[107,"","Кит Бискайский","",0]
[108,"","Сферомия пятнистая","",0]
[110,"","Королева Ньяса","",0]
[115,"","Неалот","",0]
[118,"","Крылатка-зебра","",0]
[119,"","Тигровая рыба обыкновенная","",0]
[120,"","Китовая акула - альбинос","",0]
[121,"","","",0]
[122,"","Свистулька голубопятнистая","",0]
[126,"","Тиляпия галилейская","",0]
[131,"","Шильб полосатый","",0]
[145,"","Линофрина индийская","",0]
[146,"","Аба-аба","",0]
[149,"","Акула - квагга","",0]
[150,"","Оксимонокант длиннорылый","",0]
[151,"","Макрурус вооруженный","",0]
[152,"","Группер белоокаймленный","",0]
[153,"","Синодонтис вуалевый","",0]
[154,"","Велифер","",0]
[156,"","Конус березовый","",0]
[163,"","Конус дворцовый","",0]
[164,"","Конус Мильн-Эдвардса","",0]
[165,"","Ящерица каймановая","",0]
[166,"","Ампуллярия","",0]
[167,"","Цихлазома мезонаута","",0]
[169,"","Хемиодопсис","",0]
[171,"","Серцевидка","",0]
[172,"","Морская свинья Далля","",0]
[173,"","Акула плоскоголовая","",0]
[175,"","Пирапитинга","",0]
[177,"","Пиранья стройная","",0]
[183,"","Таедо","",0]
[185,"","Волютопсиус каштановый","",0]
[186,"","Спинорог золотоплавниковый","",0]
[187,"","Глаукус","",0]
[188,"","Спинорог бело-зеленый","",0]
[189,"","Ликодонт яванский","",0]
[190,"","Полосатик Идена","",0]
[191,"","Бисса","",0]
[196,"","Креветка северная","",0]
[199,"","Необерингиус Фрилея","",0]
[203,"","Перечный слизняк","",0]
[204,"","Ремнезуб атлантический","",0]
[205,"","Краб вельветовый","",0]
[206,"","Тунец макрелевый","",0]
[211,"","Краб Мраморный","",0]
[212,"","Кои Ямабуки Огон","",0]
[213,"","Чоп","",0]
[215,"","Итальянский усач","",0]
[217,"","Евдошка европейская","",0]
[219,"","Помакант рябой","",0]
[223,"","Младица или Лосось дунайский","",0]
[225,"","Логгерхед","",0]
[226,"","Наутилус палаванский","",0]
[227,"","Лепоринус Фредерика","",0]
[228,"","Метиннис пятнистый","",0]
[233,"","Пираиба","",0]
[234,"","Павлиний окунь ленточный","",0]
[235,"","Милеус ленточный","",0]
[236,"","Милоссома килебрюхая","",0]
[237,"","Аравана черная","",0]
[239,"","Анаконда","",0]
[240,"","Акара голубовато-пятнистая","",0]
[241,"","Акарихтис Хекеля","",0]
[242,"","Дианема полосатохвостая","",0]
[243,"","Дискус Хеккеля","",0]
[244,"","Джакунда","",0]
[246,"","Гидромедуза бразильская","",0]
[247,"","Саблезуб","",0]
[249,"","Рыба-капля","",0]
[250,"","Бельдюга Андрияшева","",0]
[251,"","Макропинна","",0]
[252,"","Черный нож","",0]
[253,"","Пиранья крапчатая","",0]
[254,"","Алепизавр","",0]
[255,"","Скат гладкий","",0]
[256,"","Кракен","",0]
[257,"","Павлиний окунь королевский","",0]
[258,"","Оринокский крокодил","",0]
[259,"","Акула коромандельская","",0]
[262,"","Голец чукотский","",0]
[263,"","Морская свинья очковая","",0]
[264,"","Амия","",0]
[265,"","Осетр белый","",0]
[266,"","Хендфиш","",0]
[267,"","Акула Мицукури","",0]
[268,"","Рыба-сабля","",0]
[269,"","Галаксия чилийская","",0]
[270,"","Жемчужная рыба","",0]
[271,"","Пайара","",0]
[272,"","Акула плащеносная","",0]
[273,"","Акула-домовой","",0]
[274,"","Акула светящаяся","",0]
[275,"","Кои Асаги","",0]
[276,"","Чешуеед,  Плагиотрем чешуеедный","",0]
[277,"","Кайман широкомордый","",0]
[278,"","Форель апачей","",0]
[279,"","Губка-лира","",0]
[280,"","Клюворыл Шепарда","",0]
[283,"","Пирарара","",0]
[284,"","Скат акулохвостый","",0]
[285,"","Носорог пятнистый","",0]
[286,"","Матамата","",0]
[287,"","Лазианциструс","",0]
[288,"","Панцирник мисиссипский","",0]
[289,"","Рак красный флоридский","",0]
[290,"","Панцирник длиннорылый","",0]
[291,"","Евдошка американская","",0]
[293,"","Омар норвежский","",0]
[297,"","Осьминог семирукий","",0]
[299,"","Рыбальдо","",0]
[301,"","Морская свинья аргентинская","",0]
[303,"","Буффало большеротый","",0]
[305,"","Венера воздушная","",0]
[310,"","Голец белый","",0]
[311,"","Кои Утсури","",0]
[312,"","","",0]
[313,"","Акула копьезубая","",0]
[315,"","Плавун южный","",0]
[316,"","Кит гренландский","",0]
[319,"","","",0]
[320,"","","",0]
[321,"","Омуль баргузинский","",0]
[322,"","","",0]
{"$rows_left_out":1158}
{"sheet":"Выгрузка","index":2,"n_rows":1457,"n_cols":5,"rows_kept":1457,"cut":false,"hidden":true,"merged":[]}
["Серверы"]
["Вход или регистрация"]
["Войти Регистрация Забыли пароль? Не пришел пароль?"]
["Загрузить"]
["Загрузить игру"]
["Обои на рабочий стол"]
["Новости"]
["Турниры"]
["Регулярные турниры"]
["Big Game Fishing"]
["Рейтинги"]
["Рейтинги игроков"]
["Таблица рекордов"]
["Командный турнирный рейтинг"]
["Командный дуэльный рейтинг"]
["Справочник"]
["Статистика сервера"]
["Цены на рыбу"]
["Список рыбы"]
["Список предметов"]
["Список водоемов"]
["Вопросы и ответы"]
["Мобильная версия"]
["Загрузить игру МРР"]
["Помощь и советы МРР"]
["Таблица рекордов МРР"]
["Цены на рыбу МРР"]
["Карта сервера МРР"]
["Расписание турниров МРР"]
["Рейтинги игроков МРР"]
["Рейтинг команд МРР"]
["Разработка"]
["Сообщество"]
["Форум"]
["Социальные сети"]
["Главная »"]
["Цены на рыбу"]
[]
["Цены на рыбу"]
[]
["Стоимость рыбы меняется каждые 5 реальных часов. Чем больше продают данную рыбу, тем меньше она стоит."]
[]
["Ниже представлен спрос на рыбу в порядке убывания."]
["Последнее изменение цен было в 15:25 МСК."]
["Место:","Рыба:",null,"Прогресс:","Продано (шт):"]
[1,null,"Косаткодельфин",null,0]
[2,null,"Морская свинья бесперая",null,0]
[3,null,"Рыба луна короткая",null,0]
[4,null,"Манта рифовая",null,0]
[5,null,"Рыба-луна овальная",null,0]
[6,null,"Сельдь чёшско-печорская",null,0]
[7,null,"Сельдь волжская",null,0]
[8,null,"Менхэден бразильский",null,0]
[9,null,"Бэрардиус Бэрда",null,0]
[10,null,"Акула мозамбикская бычья",null,0]
[11,null,"Кит синий альбинос",null,0]
[12,null,"Группер Малабарский",null,0]
[13,null,"Осьминог Думбо",null,0]
[14,null,"Кит японский",null,0]
[15,null,"Кит синий северный",null,7]
[16,null,"Антимора клюворылая",null,0]
[17,null,"Косатка малая",null,0]
[18,null,"Осетр адриатический",null,1]
[19,null,"Афалина",null,0]
[20,null,"Ремнезуб командорский",null,0]
[21,null,"Пузанок северокаспийский",null,0]
[22,null,"Рыба-тряпка",null,0]
[23,null,"Чешуйчатник",null,0]
[24,null,"Семапрохилодус",null,0]
[25,null,"Морская свинья обыкновенная",null,0]
[26,null,"Эолидия",null,0]
[27,null,"Конус письменный",null,1]
[28,null,"Бычеглаз-хамрур",null,5]
[29,null,"Мурджан",null,58]
[30,null,"Кланкулюс",null,0]
[31,null,"Граммистес шестиполосый",null,0]
[32,null,"Кит северный гладкий",null,5]
[33,null,"Форель Бива",null,0]
[34,null,"Вьюн амурский",null,0]
[35,null,"Сельдь тихоокеанская",null,0]
[36,null,"Сельдь атлантическая",null,0]
[37,null,"Кит южный гладкий",null,0]
[38,null,"Каранкс бронзовый",null,0]
[39,null,"Кинжалозуб",null,0]
[40,null,"Полосатик Омуры",null,0]
[41,null,"Каранкс Гебера",null,0]
[42,null,"Голец узонский",null,1]
[43,null,"Кижуч озерный",null,0]
[44,null,"Голец носатый",null,0]
[45,null,"Голец дальнеозерский",null,1]
[46,null,"Голец длинноголовый",null,2]
[47,null,"Форель остроголовая",null,0]
[48,null,"Хариус Камчатский",null,17]
[49,null,"Осетр тихоокеанский",null,0]
[50,null,"Корюшка озерная малоротая",null,30]
[51,null,"Нерка карликовая",null,21]
[52,null,"Рыба-ремень, сельдяной король",null,0]
[53,null,"Катран вануатский",null,0]
[54,null,"Краб-йети",null,0]
[55,null,"Акулеола черная",null,0]
[56,null,"Акула черная (Далатия)",null,0]
[57,null,"Хирург-Ахиллес",null,0]
[58,null,"Мегалодон",null,0]
[59,null,"Мешкорот",null,0]
[60,null,"Багре хигучи",null,0]
[61,null,"Акула эполетовая",null,0]
[62,null,"Акула губастая",null,0]
[63,null,"Пилонос японский",null,0]
[64,null,"Плиотрема",null,0]
[65,null,"Австралийский пилонос",null,0]
[66,null,"Минога сибирская",null,0]
[67,null,"Палтус американский",null,0]
[68,null,"Центрина Австралийская",null,0]
[69,null,"Семга Камчатская",null,2]
[70,null,"Хвостокол кольчатый",null,0]
[71,null,"Сарпа",null,0]
[72,null,"Форель Дональдсона",null,0]
[73,null,"Акула сигарная",null,0]
[74,null,"Акула скульптурная",null,0]
[75,null,"Акула - свинья",null,0]
[76,null,"Акула острозубая",null,1]
[77,null,"Акула светлохвостая",null,0]
[78,null,"Лихия",null,0]
[79,null,"Маллисквама",null,0]
[80,null,"Камбала двухцветная",null,0]
[81,null,"Акула шершавая",null,0]
[82,null,"Калкан черноморский",null,0]
[83,null,"Сом жирафовый",null,3]
[84,null,"Карп африканский",null,9]
[85,null,"Фахака",null,8]
[86,null,"Группер красноротый",null,18]
[87,null,"Протоптер мраморный",null,2]
[88,null,"Полиптер",null,7]
[89,null,"Семутунду",null,6]
[90,null,"Мормиропс угревидный",null,15]
[91,null,"Лягушка нильская",null,0]
[92,null,"Мелания песчаная",null,0]
[93,null,"Карась морской чернополосый",null,2]
[94,null,"Карась-барабан",null,0]
[95,null,"Шипощёк длинноперый",null,0]
[96,null,"Рыба-кабан трехполосая",null,0]
[97,null,"Удильщик Джонсона",null,0]
[98,null,"Скат-торпедо электрический",null,1]
[99,null,"Мурена гигантская",null,7]
[100,null,"Скат-орляк пятнистый",null,0]
[101,null,"Луциан - Бохар",null,12]
[102,null,"Тунец индо-тихоокеанский",null,10]
[103,null,"Акула свиноглазая",null,3]
[104,null,"Аулонокара Бенша",null,6]
[105,null,"Аулонокара Ньяса",null,3]
[106,null,"Аристохромис Кpucmu",null,7]
[107,null,"Кит Бискайский",null,0]
[108,null,"Сферомия пятнистая",null,0]
[109,null,"Клоун танганьикский",null,8]
[110,null,"Королева Ньяса",null,0]
[111,null,"Кальвус",null,27]
[112,null,"Бабочка малавийская",null,79]
[113,null,"Бычок краснозубый",null,10]
[114,null,"Мурена перечная",null,4]
[115,null,"Неалот",null,0]
[116,null,"Мена пятнистая",null,2]
[117,null,"Бородавчатка красноморская",null,3]
[118,null,"Крылатка-зебра",null,0]
[119,null,"Тигровая рыба обыкновенная",null,0]
[120,null,"Китовая акула - альбинос",null,0]
[121,null,null,null,0]
[122,null,"Свистулька голубопятнистая",null,0]
[123,null,"Скорпенопсис дьявольский",null,5]
[124,null,"Собачка речная",null,4]
[125,null,"Скат тэниура лимма",null,3]
[126,null,"Тиляпия галилейская",null,0]
[127,null,"Убанги",null,10]
[128,null,"Тиляпия нильская",null,17]
[129,null,"Баяд",null,7]
[130,null,"Сом электрический",null,10]
[131,null,"Шильб полосатый",null,0]
[132,null,"Башир",null,38]
[133,null,"Ящероголов красный",null,14]
[134,null,"Каранг золотой",null,12]
[135,null,"Акула рифовая",null,2]
[136,null,"Группер таувина",null,4]
[137,null,"Тунец скумбриевидный",null,26]
[138,null,"Тилозур красноморский",null,1]
[139,null,"Цитарина обыкновенная",null,7]
[140,null,"Хемихромис-красавец",null,31]
[141,null,"Алеста",null,59]
[142,null,"Поллимир Исидора",null,6]
[143,null,"Тиляпия Зилля",null,18]
[144,null,"Нильский окунь",null,4]
[145,null,"Линофрина индийская",null,0]
[146,null,"Аба-аба",null,0]
[147,null,"Горгасия красноморская",null,1]
[148,null,"Вунду",null,20]
[149,null,"Акула - квагга",null,0]
[150,null,"Оксимонокант длиннорылый",null,0]
[151,null,"Макрурус вооруженный",null,0]
[152,null,"Группер белоокаймленный",null,0]
[153,null,"Синодонтис вуалевый",null,0]
[154,null,"Велифер",null,0]
[155,null,"Крокодил нильский",null,1]
{"$rows_left_out":1258}
{"sheet":"Вычисления","index":3,"n_rows":56,"n_cols":5,"rows_kept":56,"cut":false,"hidden":true,"merged":[]}
[]
[null,null,4291,904,{"$f":"VLOOKUP(MAX(Table_0[Место:]),'Выгрузка с сайта'!$A:$E,5,0)","v":22845}]
[null,null,179,278,{"$f":"VLOOKUP($A$5,'Выгрузка с сайта'!$C:$E,3,0)","v":22845}]
[null,"х",{"$f":" 1 - C3/C2","v":0.95828478210207413},{"$f":" 1 - D3/D2","v":0.69247787610619471},{"$f":" 1 - E3/E2","v":0}]
["Финвал","у",0.9036766383223076,0.71277011049343675,{"$f":"E7*E4+E6","v":0.21542205841613671}]
[null,"b",{"$f":"C5-C7*C4","v":0.21542205841613671},{"$f":"D5-D7*D4","v":0.21542205841613671},{"$f":"D6","v":0.21542205841613671}]
[null,"a",{"$f":"($C$5-$D$5)/($C$4-$D$4)","v":0.71821507839916809},{"$f":"($C$5-$D$5)/($C$4-$D$4)","v":0.71821507839916809},{"$f":"D7","v":0.71821507839916809}]
[]
[null,null,4282,4915,{"$f":"VLOOKUP(MAX(Table_0[Место:]),'Выгрузка с сайта'!$A:$E,5,0)","v":22845}]
[null,null,30,2819,{"$f":"VLOOKUP($A$12,'Выгрузка с сайта'!$C:$E,3,0)","v":54}]
[null,"х",{"$f":" 1 - C10/C9","v":0.99299392807099485},{"$f":" 1 - D10/D9","v":0.42644964394710072},{"$f":" 1 - E10/E9","v":0.99763624425476038}]
["Кит Горбатый","у",1.0918462662952506,0.61343206646451676,{"$f":"E14*E11+E13","v":1.0957664364296154}]
[null,"b",{"$f":"C12-C14*C11","v":0.25331976651862631},{"$f":"D12-D14*D11","v":0.25331976651862631},{"$f":"D13","v":0.25331976651862631}]
[null,"a",{"$f":"($C$12-$D$12)/($C$11-$D$11)","v":0.84444272625670402},{"$f":"($C$12-$D$12)/($C$11-$D$11)","v":0.84444272625670402},{"$f":"D14","v":0.84444272625670402}]
[]
[null,1289,12730,4915,{"$f":"VLOOKUP(MAX(Table_0[Место:]),'Выгрузка с сайта'!$A:$E,5,0)","v":22845}]
[null,null,58,1143,{"$f":"VLOOKUP($A$19,'Выгрузка с сайта'!$C:$E,3,0)","v":7}]
[null,"х",{"$f":" 1 - C17/C16","v":0.99544383346425769},{"$f":" 1 - D17/D16","v":0.76744659206510679},{"$f":" 1 - E17/E16","v":0.99969358721820967}]
["Кит синий северный","у",1.4393780101620015,1.1860464077026547,{"$f":"E21*E18+E20","v":1.4440999836470292}]
[null,"b",{"$f":"C19-C21*C18","v":0.3333234809833221},{"$f":"D19-D21*D18","v":0.33332348098332198},{"$f":"D20","v":0.33332348098332198}]
[null,"a",{"$f":"($C$19-$D$19)/($C$18-$D$18)","v":1.1111169631032662},{"$f":"($C$19-$D$19)/($C$18-$D$18)","v":1.1111169631032662},{"$f":"D21","v":1.1111169631032662}]
[]
[null,null,4282,4915,{"$f":"VLOOKUP(MAX(Table_0[Место:]),'Выгрузка с сайта'!$A:$E,5,0)","v":22845}]
[null,null,151,652,{"$f":"VLOOKUP($A$26,'Выгрузка с сайта'!$C:$E,3,0)","v":339}]
[null,"х",{"$f":" 1 - C24/C23","v":0.9647361046240075},{"$f":" 1 - D24/D23","v":0.8673448626653103},{"$f":" 1 - E24/E23","v":0.9851608667104399}]
["Кашалот","у",1.0199457510417711,0.94140077880703943,{"$f":"E28*E25+E27","v":1.0364180984388829}]
[null,"b",{"$f":"C26-C28*C25","v":0.24189662642262444},{"$f":"D26-D28*D25","v":0.24189662642262444},{"$f":"D27","v":0.24189662642262444}]
[null,"a",{"$f":"($C$26-$D$26)/($C$25-$D$25)","v":0.8064890708349518},{"$f":"($C$26-$D$26)/($C$25-$D$25)","v":0.8064890708349518},{"$f":"D28","v":0.8064890708349518}]
[]
[null,null,12730,4915,{"$f":"VLOOKUP(MAX(Table_0[Место:]),'Выгрузка с сайта'!$A:$E,5,0)","v":22845}]
[null,null,52,455,{"$f":"VLOOKUP($A$33,'Выгрузка с сайта'!$C:$E,3,0)","v":28}]
[null,"х",{"$f":" 1 - C31/C30","v":0.99591516103692068},{"$f":" 1 - D31/D30","v":0.90742624618514756},{"$f":" 1 - E31/E30","v":0.99877434887283867}]
["Кит горбатый-альбинос","у",1.72785708885921,1.6098661823686109,{"$f":"E35*E32+E34","v":1.7316695230511308}]
[null,"b",{"$f":"C33-C35*C32","v":0.39990620557269629},{"$f":"D33-D35*D32","v":0.39990620557269629},{"$f":"D34","v":0.39990620557269629}]
[null,"a",{"$f":"($C$33-$D$33)/($C$32-$D$32)","v":1.3333975977470673},{"$f":"($C$33-$D$33)/($C$32-$D$32)","v":1.3333975977470673},{"$f":"D35","v":1.3333975977470673}]
[]
[null,null,12730,4915,{"$f":"VLOOKUP(MAX(Table_0[Место:]),'Выгрузка с сайта'!$A:$E,5,0)","v":22845}]
[null,null,13,16,{"$f":"VLOOKUP($A$40,'Выгрузка с сайта'!$C:$E,3,0)","v":8}]
[null,"х",{"$f":" 1 - C38/C37","v":0.9989787902592302},{"$f":" 1 - D38/D37","v":0.99674465920651067},{"$f":" 1 - E38/E37","v":0.99964981396366814}]
["Кит серый","у",0.952566527000136,0.95092123799865036,{"$f":"E42*E39+E41","v":0.95306069135065785}]
[null,"b",{"$f":"C40-C42*C39","v":0.21688505731632424},{"$f":"D40-D42*D39","v":0.21688505731632424},{"$f":"D41","v":0.21688505731632424}]
[null,"a",{"$f":"($C$40-$D$40)/($C$39-$D$39)","v":0.73643352277069463},{"$f":"($C$40-$D$40)/($C$39-$D$39)","v":0.73643352277069463},{"$f":"D42","v":0.73643352277069463}]
[]
[null,null,12730,4915,{"$f":"VLOOKUP(MAX(Table_0[Место:]),'Выгрузка с сайта'!$A:$E,5,0)","v":22845}]
[null,null,23,303,{"$f":"VLOOKUP($A$47,'Выгрузка с сайта'!$C:$E,3,0)","v":0}]
[null,"х",{"$f":" 1 - C45/C44","v":0.99819324430479184},{"$f":" 1 - D45/D44","v":0.93835198372329609},{"$f":" 1 - E45/E44","v":1}]
["Кит японский","у",2.1636521239056639,2.0639128574312569,{"$f":"E49*E46+E48","v":2.1666634991004274}]
[null,"b",{"$f":"C47-C49*C46","v":0.49993279347674613},{"$f":"D47-D49*D46","v":0.49993279347674613},{"$f":"D48","v":0.49993279347674613}]
[null,"a",{"$f":"($C$47-$D$47)/($C$46-$D$46)","v":1.6667307056236815},{"$f":"($C$47-$D$47)/($C$46-$D$46)","v":1.6667307056236815},{"$f":"D49","v":1.6667307056236815}]
[]
[null,null,12730,4915,{"$f":"VLOOKUP(MAX(Table_0[Место:]),'Выгрузка с сайта'!$A:$E,5,0)","v":22845}]
[null,null,199,117,{"$f":"VLOOKUP($A$54,'Выгрузка с сайта'!$C:$E,3,0)","v":211}]
[null,"х",{"$f":" 1 - C52/C51","v":0.98436763550667716},{"$f":" 1 - D52/D51","v":0.97619532044760937},{"$f":" 1 - E52/E51","v":0.99076384329174871}]
["Сейвал или кит ивасевый","у",0.61007123665853236,0.60618136174091253,{"$f":"E56*E53+E55","v":0.61311571647253904}]
[null,"b",{"$f":"C54-C56*C53","v":0.14152995461073287},{"$f":"D54-D56*D53","v":0.14152995461073287},{"$f":"D55","v":0.14152995461073287}]
[null,"a",{"$f":"($C$54-$D$54)/($C$53-$D$53)","v":0.47598200626194936},{"$f":"($C$54-$D$54)/($C$53-$D$53)","v":0.47598200626194936},{"$f":"D56","v":0.47598200626194936}]