{"text_format":"1","workbook":"xlsx","n_sheets":4,"sheets":["Кэфы","Выгрузка с сайта","Выгрузка","Вычисления"],"not_rendered":{"charts":0,"images":1,"macros":1,"external_links":0,"defined_names":2,"comments":0,"pivot_tables":0},"unopened":[],"bounds":{"document_bytes":16777216,"sheet_cells":100000,"rows_first":2000,"rows_last":500,"rows_between":2000,"halvings":0,"cell_chars":16384,"cell_head_chars":4096},"cells_cut":0,"cells_raw":0,"read":"whole","date_system":"1900"}

{"sheet":"Кэфы","index":0,"n_rows":25,"n_cols":6,"rows_kept":25,"cut":false,"hidden":false,"merged":[[15,1,18,5]]}
[]
[]
[]
[null,"До следующего обновления цен на рыбу осталось:",null,null,{"$f":"HOUR(TEXT(IF(TEXT(MID(INDEX(Выгрузка!$A:$A,MATCH(\"Последнее изменение цен было в *\",Выгрузка!$A:$A,0),1),32,5)*1+5/24,\"ч:мм\")*1-(NOW()-TODAY())<0, TEXT(MID(INDEX(Выгрузка!$A:$A,MATCH(\"Последнее изменение цен было в *\",Выгрузка!$A:$A,0),1),32,5)*1+5/24,\"ч:мм\")*1-(NOW()-TODAY())+1,TEXT(MID(INDEX(Выгрузка!$A:$A,MATCH(\"Последнее изменение цен было в *\",Выгрузка!$A:$A,0),1),32,5)*1+5/24,\"ч:мм\")*1-(NOW()-TODAY())),\"ч:мм\"))&\"ч \"&MINUTE(TEXT(IF(TEXT(MID(INDEX(Выгрузка!$A:$A,MATCH(\"Последнее изменение цен было в *\",Выгрузка!$A:$A,0),1),32,5)*1+5/24,\"ч:мм\")*1-(NOW()-TODAY())<0, TEXT(MID(INDEX(Выгрузка!$A:$A,MATCH(\"Последнее изменение цен было в *\",Выгрузка!$A:$A,0),1),32,5)*1+5/24,\"ч:мм\")*1-(NOW()-TODAY())+1,TEXT(MID(INDEX(Выгрузка!$A:$A,MATCH(\"Последнее изменение цен было в *\",Выгрузка!$A:$A,0),1),32,5)*1+5/24,\"ч:мм\")*1-(NOW()-TODAY())),\"ч:мм\"))&\"мин\"","v":"3ч 19мин"},"реального времени"]
[]
[null,"Кит","Шт.","Текущий кэф","Макс. кэф","% от макс.*"]
[null,"Кашалот",{"$f":"INDEX(Вычисления!$1:$1048576,MATCH($B7,Вычисления!$A:$A,0)-2,5)","v":143},{"$f":"IF(C7<=10, \"Баг с ценой\", VLOOKUP(B7,Вычисления!$A:$E,5,0))","v":1.0319361269923646},1.0446149106116156,{"$f":"IF(D7=\"Баг с ценой\", \"Не продавай!\",D7/E7)","v":0.98786272004117992}]
[null,"Кит горбатый",{"$f":"INDEX(Вычисления!$1:$1048576,MATCH($B8,Вычисления!$A:$A,0)-2,5)","v":61},{"$f":"IF(C8<=10, \"Баг с ценой\", VLOOKUP(B8,Вычисления!$A:$E,5,0))","v":1.0904153231416605},1.0965083682400059,{"$f":"IF(D8=\"Баг с ценой\", \"Не продавай!\",D8/E8)","v":0.99444322973282429}]
[null,"Кит горбатый-альбинос",{"$f":"INDEX(Вычисления!$1:$1048576,MATCH($B9,Вычисления!$A:$A,0)-2,5)","v":12},{"$f":"IF(C9<=10, \"Баг с ценой\", VLOOKUP(B9,Вычисления!$A:$E,5,0))","v":1.7310215652406074},1.7322076348486417,0.99931528438960038]
[null,"Кит синий северный",{"$f":"INDEX(Вычисления!$1:$1048576,MATCH($B10,Вычисления!$A:$A,0)-2,5)","v":49},{"$f":"IF(C10<=10, \"Баг с ценой\", VLOOKUP(B10,Вычисления!$A:$E,5,0))","v":1.4366748284551432},1.4433169154018517,0.9953980398373844]
[null,"Кит серый",{"$f":"INDEX(Вычисления!$1:$1048576,MATCH($B11,Вычисления!$A:$A,0)-2,5)","v":2},{"$f":"IF(C11<=10, \"Баг с ценой\", VLOOKUP(B11,Вычисления!$A:$E,5,0))","v":"Баг с ценой"},0.952566527000136,"Не продавай!"]
[null,"Кит японский",{"$f":"INDEX(Вычисления!$1:$1048576,MATCH($B12,Вычисления!$A:$A,0)-2,5)","v":11},{"$f":"IF(C12<=10, \"Баг с ценой\", VLOOKUP(B12,Вычисления!$A:$E,5,0))","v":2.1640484601955841},2.1655516836404356,0.99930584734771855]
[null,"Сейвал или кит ивасевый",{"$f":"INDEX(Вычисления!$1:$1048576,MATCH($B13,Вычисления!$A:$A,0)-2,5)","v":67},{"$f":"IF(C13<=10, \"Баг с ценой\", VLOOKUP(B13,Вычисления!$A:$E,5,0))","v":0.61296328102393738},0.61385984162205964,0.99853947018955791]
[null,"Финвал",{"$f":"INDEX(Вычисления!$1:$1048576,MATCH($B14,Вычисления!$A:$A,0)-2,5)","v":7011},{"$f":"IF(C14<=10, \"Баг с ценой\", VLOOKUP(B14,Вычисления!$A:$E,5,0))","v":0.21542205841613671},0.92696141974044077,0.23239592698092787]
[]
[null,"* Показывает в %, насколько текущая цена велика в сравнении с максимальной известной мне. Условные обозначения в виде стрелок и соответствующие значения описаны под таблицей. Изучи их и прими решение о продаже самостоятельно или в соответствии с рекомендациями."]
[]
[]
[]
[]
[null,"[98% - 100%] Смело продавай, прекрасная цена"]
[null,"[95% - 98%] Тоже отличная цена, но нередко бывает лучше"]
[null,"[90% - 95%] Средняя цена. Лучше придержи и продай позже"]
[null,"[80% - 90%] Плохая цена. Продавай, только если срочно нужны деньги"]
[null,"Ниже 80% Рыба не в цене. Ни в коем случае не продавай"]

{"sheet":"Выгрузка с сайта","index":1,"n_rows":1354,"n_cols":5,"rows_kept":1354,"cut":false,"hidden":true,"merged":[]}
["Место:","Рыба:","Рыба:2","Прогресс:","Продано (шт):"]
[1,"","Калкан черноморский","",0]
[2,"","Камбала двухцветная","",0]
[3,"","Акула скульптурная","",0]
[4,"","Акула шершавая","",0]
[5,"","Лихия","",0]
[6,"","Палтус американский","",0]
[7,"","Австралийский пилонос","",0]
[8,"","Маллисквама","",0]
[9,"","Минога сибирская","",0]
[10,"","Акула сигарная","",0]
[11,"","Осетр тихоокеанский","",0]
[12,"","Форель остроголовая","",0]
[16,"","Акула светлохвостая","",0]
[17,"","Акула - свинья","",0]
[18,"","Акула губастая","",0]
[19,"","Акула острозубая","",0]
[20,"","Пилонос японский","",0]
[21,"","Осетр адриатический","",0]
[22,"","Антимора  клюворылая","",0]
[23,"","Афалина","",0]
[24,"","Ремнезуб командорский","",0]
[25,"","Косатка малая","",0]
[26,"","Рыба луна короткая","",0]
[27,"","Косаткодельфин","",0]
[28,"","Манта рифовая","",0]
[29,"","Рыба-луна овальная","",0]
[30,"","Группер Малабарский","",0]
[31,"","Форель Дональдсона","",0]
[32,"","Хвостокол кольчатый","",0]
[33,"","Плиотрема","",0]
[34,"","Сарпа","",0]
[35,"","Центрина Австралийская","",0]
[36,"","Осьминог Думбо","",0]
[37,"","Кит синий альбинос","",0]
[38,"","Семга Камчатская","",0]
[40,"","Кижуч озерный","",0]
[41,"","Лазианциструс","",0]
[42,"","Носорог пятнистый","",0]
[43,"","Губка-лира","",0]
[44,"","Матамата","",0]
[45,"","Пирарара","",0]
[46,"","Акула плащеносная","",0]
[47,"","Жемчужная рыба","",0]
[48,"","Скат акулохвостый","",0]
[49,"","Пайара","",0]
[50,"","Форель апачей","",0]
[51,"","Алепизавр","",0]
[52,"","Черный нож","",0]
[53,"","Скат гладкий","",0]
[54,"","Кракен","",0]
[55,"","Пиранья крапчатая","",0]
[57,"","Клюворыл Шепарда","",0]
[58,"","Акула Мицукури","",0]
[59,"","Ремнезуб перуанский","",0]
[60,"","Рыба-сабля","",0]
[61,"","Акула эполетовая","",0]
[62,"","Мешкорот","",0]
[63,"","Катран вануатский","",0]
[64,"","Багре хигучи","",0]
[65,"","Хирург-Ахиллес","",0]
[66,"","Голец носатый","",0]
[67,"","Голец узонский","",0]
[68,"","Мегалодон","",0]
[70,"","Рыба-ремень, сельдяной король","",0]
[71,"","Кайман широкомордый","",0]
[72,"","Кои Асаги","",0]
[73,"","Галаксия чилийская","",0]
[74,"","Чешуеед,  Плагиотрем чешуеедный","",0]
[75,"","Акула-домовой","",0]
[76,"","Акула черная (Далатия)","",0]
[77,"","Краб-йети","",0]
[78,"","Акула светящаяся","",0]
[79,"","Акулеола черная","",0]
[81,"","Конус дворцовый","",0]
[82,"","Плоскоголов пятнистый","",0]
[84,"","Конус Мильн-Эдвардса","",0]
[85,"","Конус текстильный","",0]
[87,"","Конус мраморный","",0]
[88,"","Конус полосатый","",0]
[89,"","Луциан горбатый","",0]
[93,"","Скат тэниура лимма","",0]
[99,"","Акула - квагга","",0]
[102,"","Шипощёк длинноперый","",0]
[103,"","Карась морской чернополосый","",0]
[106,"","Группер красноротый","",0]
[107,"","Скат-орляк пятнистый","",0]
[109,"","Удильщик Джонсона","",0]
[110,"","Аба-аба","",0]
[111,"","Синодонтис вуалевый","",0]
[113,"","Линофрина индийская","",0]
[114,"","Велифер","",0]
[115,"","Макрурус вооруженный","",0]
[116,"","Рыба-кабан трехполосая","",0]
[118,"","Оксимонокант длиннорылый","",0]
[120,"","Полосатик Омуры","",0]
[121,"","Каранкс Гебера","",0]
[122,"","Кит северный гладкий","",0]
[123,"","Форель Бива","",0]
[124,"","Кинжалозуб","",0]
[125,"","Морская свинья обыкновенная","",0]
[126,"","Эолидия","",0]
[127,"","Кит южный гладкий","",0]
[128,"","Каранкс бронзовый","",0]
[129,"","Вьюн амурский","",0]
[130,"","Акула мозамбикская бычья","",0]
[131,"","Менхэден бразильский","",0]
[132,"","Морская свинья бесперая","",0]
[133,"","Бэрардиус Бэрда","",0]
[134,"","Сельдь чёшско-печорская","",0]
[135,"","Сельдь тихоокеанская","",0]
[136,"","Сельдь атлантическая","",0]
[137,"","Сельдь волжская","",0]
[138,"","Пузанок северокаспийский","",0]
[139,"","Семапрохилодус","",0]
[143,"","Акула рифовая","",0]
[150,"","Кланкулюс","",0]
[151,"","Граммистес шестиполосый","",0]
[152,"","Рыба-тряпка","",0]
[153,"","Чешуйчатник","",0]
[156,"","Тилозур красноморский","",0]
[157,"","Конус письменный","",0]
[158,"","Бычеглаз-хамрур","",0]
[159,"","Утконос","",0]
[160,"","Иния","",0]
[161,"","Колоссома","",0]
[162,"","Дианема полосатохвостая","",0]
[163,"","Дискус Хеккеля","",0]
[164,"","Лепоринус зебровый","",0]
[165,"","Милеус ленточный","",0]
[166,"","Милоссома килебрюхая","",0]
[167,"","Лепоринус Фредерика","",0]
[169,"","Джакунда","",0]
[170,"","Акара голубовато-пятнистая","",0]
[171,"","Акарихтис Хекеля","",0]
[172,"","Конгер обуд","",0]
[173,"","Кои Платинум Огон","",0]
[174,"","Анаконда","",0]
[175,"","Биара","",0]
[176,"","Гидромедуза бразильская","",0]
[177,"","Аравана черная","",0]
[178,"","Астронотус глаздчатый","",0]
[179,"","Павлиний окунь ленточный","",0]
[180,"","Хараки","",0]
[181,"","Хемиодопсис","",0]
[183,"","Уару","",0]
[184,"","Цихлазома мезонаута","",0]
[185,"","Акула плоскоголовая","",0]
[186,"","Запрора","",0]
[187,"","Ящерица каймановая","",0]
[188,"","Ампуллярия","",0]
[190,"","Пиракатинга","",0]
[192,"","Пака","",0]
[193,"","Пираиба","",0]
[194,"","Пиранья стройная","",0]
[195,"","Таедо","",0]
[196,"","Тамбаку","",0]
[197,"","Пирапитинга","",0]
[198,"","Пираруку","",0]
[199,"","Краб Мраморный","",0]
[200,"","Офиура полосатая","",0]
[201,"","Голубая линкия","",0]
[202,"","Фромия элегантная","",0]
[203,"","Морская звезда красношипая","",0]
[204,"","Тасманский краб","",0]
[205,"","Гимносарда","",0]
[207,"","Акула узкозубая","",0]
[208,"","Ангел  черноплавничный","",0]
[209,"","Гребешок коралловый","",0]
[211,"","Спинорог Розовохвостый","",0]
[212,"","Спинорог желтомордый","",0]
[214,"","Черепаха зеленая","",0]
[216,"","Конус Географический","",0]
[218,"","Стромбус Королевский","",0]
[221,"","Скат мозаичный","",0]
[223,"","Осьминог обыкновенный","",0]
[224,"","Тунец макрелевый","",0]
[226,"","Чоп","",0]
[228,"","Усач Валецкого","",0]
[229,"","Младица или Лосось дунайский","",0]
[231,"","Сиган звездчатый","",0]
[232,"","Кузовок рогатый","",0]
[233,"","Акула мальгашская","",0]
[234,"","Голец альпийский","",0]
[236,"","Логгерхед","",0]
[238,"","Евдошка европейская","",0]
[239,"","","",0]
[240,"","","",0]
[241,"","","",0]
[242,"","","",0]
[243,"","","",0]
[244,"","Кои Утсури","",0]
[245,"","Акула исландская","",0]
[246,"","","",0]
[247,"","Акула копьезубая","",0]
[248,"","","",0]
[249,"","Омар норвежский","",0]
[250,"","Омар европейский","",0]
[251,"","Осьминог семирукий","",0]
[253,"","Краб снежный","",0]
{"$rows_left_out":1155}
{"sheet":"Выгрузка","index":2,"n_rows":1454,"n_cols":5,"rows_kept":1454,"cut":false,"hidden":true,"merged":[]}
["Серверы"]
["Вход или регистрация"]
["Войти Регистрация Забыли пароль? Не пришел пароль?"]
["Загрузить"]
["Загрузить игру"]
["Обои на рабочий стол"]
["Новости"]
["Турниры"]
["Регулярные турниры"]
["Big Game Fishing"]
["Рейтинги"]
["Рейтинги игроков"]
["Таблица рекордов"]
["Командный турнирный рейтинг"]
["Командный дуэльный рейтинг"]
["Справочник"]
["Статистика сервера"]
["Цены на рыбу"]
["Список рыбы"]
["Список предметов"]
["Список водоемов"]
["Вопросы и ответы"]
["Мобильная версия"]
["Загрузить игру МРР"]
["Помощь и советы МРР"]
["Таблица рекордов МРР"]
["Цены на рыбу МРР"]
["Карта сервера МРР"]
["Расписание турниров МРР"]
["Рейтинги игроков МРР"]
["Рейтинг команд МРР"]
["Разработка"]
["Сообщество"]
["Форум"]
["Социальные сети"]
["Главная »"]
["Цены на рыбу"]
[]
["Цены на рыбу"]
[]
["Стоимость рыбы меняется каждые 5 реальных часов. Чем больше продают данную рыбу, тем меньше она стоит."]
[]
["Ниже представлен спрос на рыбу в порядке убывания."]
["Последнее изменение цен было в 10:43 МСК."]
["Место:","Рыба:",null,"Прогресс:","Продано (шт):"]
[1,null,"Калкан черноморский",null,0]
[2,null,"Камбала двухцветная",null,0]
[3,null,"Акула скульптурная",null,0]
[4,null,"Акула шершавая",null,0]
[5,null,"Лихия",null,0]
[6,null,"Палтус американский",null,0]
[7,null,"Австралийский пилонос",null,0]
[8,null,"Маллисквама",null,0]
[9,null,"Минога сибирская",null,0]
[10,null,"Акула сигарная",null,0]
[11,null,"Осетр тихоокеанский",null,0]
[12,null,"Форель остроголовая",null,0]
[13,null,"Корюшка озерная малоротая",null,21]
[14,null,"Нерка карликовая",null,22]
[15,null,"Хариус Камчатский",null,7]
[16,null,"Акула светлохвостая",null,0]
[17,null,"Акула - свинья",null,0]
[18,null,"Акула губастая",null,0]
[19,null,"Акула острозубая",null,0]
[20,null,"Пилонос японский",null,0]
[21,null,"Осетр адриатический",null,0]
[22,null,"Антимора клюворылая",null,0]
[23,null,"Афалина",null,0]
[24,null,"Ремнезуб командорский",null,0]
[25,null,"Косатка малая",null,0]
[26,null,"Рыба луна короткая",null,0]
[27,null,"Косаткодельфин",null,0]
[28,null,"Манта рифовая",null,0]
[29,null,"Рыба-луна овальная",null,0]
[30,null,"Группер Малабарский",null,0]
[31,null,"Форель Дональдсона",null,0]
[32,null,"Хвостокол кольчатый",null,0]
[33,null,"Плиотрема",null,0]
[34,null,"Сарпа",null,0]
[35,null,"Центрина Австралийская",null,0]
[36,null,"Осьминог Думбо",null,0]
[37,null,"Кит синий альбинос",null,0]
[38,null,"Семга Камчатская",null,0]
[39,null,"Кит японский",null,11]
[40,null,"Кижуч озерный",null,0]
[41,null,"Лазианциструс",null,0]
[42,null,"Носорог пятнистый",null,0]
[43,null,"Губка-лира",null,0]
[44,null,"Матамата",null,0]
[45,null,"Пирарара",null,0]
[46,null,"Акула плащеносная",null,0]
[47,null,"Жемчужная рыба",null,0]
[48,null,"Скат акулохвостый",null,0]
[49,null,"Пайара",null,0]
[50,null,"Форель апачей",null,0]
[51,null,"Алепизавр",null,0]
[52,null,"Черный нож",null,0]
[53,null,"Скат гладкий",null,0]
[54,null,"Кракен",null,0]
[55,null,"Пиранья крапчатая",null,0]
[56,null,"Тауматихт Акселя",null,1]
[57,null,"Клюворыл Шепарда",null,0]
[58,null,"Акула Мицукури",null,0]
[59,null,"Ремнезуб перуанский",null,0]
[60,null,"Рыба-сабля",null,0]
[61,null,"Акула эполетовая",null,0]
[62,null,"Мешкорот",null,0]
[63,null,"Катран вануатский",null,0]
[64,null,"Багре хигучи",null,0]
[65,null,"Хирург-Ахиллес",null,0]
[66,null,"Голец носатый",null,0]
[67,null,"Голец узонский",null,0]
[68,null,"Мегалодон",null,0]
[69,null,"Голец дальнеозерский",null,1]
[70,null,"Рыба-ремень, сельдяной король",null,0]
[71,null,"Кайман широкомордый",null,0]
[72,null,"Кои Асаги",null,0]
[73,null,"Галаксия чилийская",null,0]
[74,null,"Чешуеед, Плагиотрем чешуеедный",null,0]
[75,null,"Акула-домовой",null,0]
[76,null,"Акула черная (Далатия)",null,0]
[77,null,"Краб-йети",null,0]
[78,null,"Акула светящаяся",null,0]
[79,null,"Акулеола черная",null,0]
[80,null,"Конус березовый",null,1]
[81,null,"Конус дворцовый",null,0]
[82,null,"Плоскоголов пятнистый",null,0]
[83,null,"Крокодил нильский",null,2]
[84,null,"Конус Мильн-Эдвардса",null,0]
[85,null,"Конус текстильный",null,0]
[86,null,"Вунду",null,18]
[87,null,"Конус мраморный",null,0]
[88,null,"Конус полосатый",null,0]
[89,null,"Луциан горбатый",null,0]
[90,null,"Башир",null,25]
[91,null,"Ящероголов красный",null,5]
[92,null,"Собачка речная",null,9]
[93,null,"Скат тэниура лимма",null,0]
[94,null,"Шильб полосатый",null,33]
[95,null,"Нильский окунь",null,7]
[96,null,"Тигровая рыба нильская",null,1]
[97,null,"Баяд",null,15]
[98,null,"Сом электрический",null,11]
[99,null,"Акула - квагга",null,0]
[100,null,"Карась-барабан",null,2]
[101,null,"Луциан - Бохар",null,1]
[102,null,"Шипощёк длинноперый",null,0]
[103,null,"Карась морской чернополосый",null,0]
[104,null,"Тунец индо-тихоокеанский",null,5]
[105,null,"Мурена гигантская",null,3]
[106,null,"Группер красноротый",null,0]
[107,null,"Скат-орляк пятнистый",null,0]
[108,null,"Скат-торпедо электрический",null,1]
[109,null,"Удильщик Джонсона",null,0]
[110,null,"Аба-аба",null,0]
[111,null,"Синодонтис вуалевый",null,0]
[112,null,"Горгасия красноморская",null,1]
[113,null,"Линофрина индийская",null,0]
[114,null,"Велифер",null,0]
[115,null,"Макрурус вооруженный",null,0]
[116,null,"Рыба-кабан трехполосая",null,0]
[117,null,"Группер белоокаймленный",null,1]
[118,null,"Оксимонокант длиннорылый",null,0]
[119,null,"Тиляпия галилейская",null,6]
[120,null,"Полосатик Омуры",null,0]
[121,null,"Каранкс Гебера",null,0]
[122,null,"Кит северный гладкий",null,0]
[123,null,"Форель Бива",null,0]
[124,null,"Кинжалозуб",null,0]
[125,null,"Морская свинья обыкновенная",null,0]
[126,null,"Эолидия",null,0]
[127,null,"Кит южный гладкий",null,0]
[128,null,"Каранкс бронзовый",null,0]
[129,null,"Вьюн амурский",null,0]
[130,null,"Акула мозамбикская бычья",null,0]
[131,null,"Менхэден бразильский",null,0]
[132,null,"Морская свинья бесперая",null,0]
[133,null,"Бэрардиус Бэрда",null,0]
[134,null,"Сельдь чёшско-печорская",null,0]
[135,null,"Сельдь тихоокеанская",null,0]
[136,null,"Сельдь атлантическая",null,0]
[137,null,"Сельдь волжская",null,0]
[138,null,"Пузанок северокаспийский",null,0]
[139,null,"Семапрохилодус",null,0]
[140,null,"Поллимир Исидора",null,8]
[141,null,"Тиляпия Зилля",null,20]
[142,null,"Каранг золотой",null,19]
[143,null,"Акула рифовая",null,0]
[144,null,"Алеста",null,9]
[145,null,"Убанги",null,1]
[146,null,"Тиляпия нильская",null,12]
[147,null,"Цитарина обыкновенная",null,15]
[148,null,"Хемихромис-красавец",null,24]
[149,null,"Группер таувина",null,1]
[150,null,"Кланкулюс",null,0]
[151,null,"Граммистес шестиполосый",null,0]
[152,null,"Рыба-тряпка",null,0]
[153,null,"Чешуйчатник",null,0]
[154,null,"Мурджан",null,6]
[155,null,"Тунец скумбриевидный",null,3]
{"$rows_left_out":1255}
{"sheet":"Вычисления","index":3,"n_rows":56,"n_cols":5,"rows_kept":56,"cut":false,"hidden":true,"merged":[]}
[]
[null,null,4291,904,{"$f":"VLOOKUP(1353,'Выгрузка с сайта'!$A:$E,5,0)","v":7011}]
[null,null,179,278,{"$f":"VLOOKUP($A$5,'Выгрузка с сайта'!$C:$E,3,0)","v":7011}]
[null,"х",{"$f":" 1 - C3/C2","v":0.95828478210207413},{"$f":" 1 - D3/D2","v":0.69247787610619471},{"$f":" 1 - E3/E2","v":0}]
["Финвал","у",0.9036766383223076,0.71277011049343675,{"$f":"E7*E4+E6","v":0.21542205841613671}]
[null,"b",{"$f":"C5-C7*C4","v":0.21542205841613671},{"$f":"D5-D7*D4","v":0.21542205841613671},{"$f":"D6","v":0.21542205841613671}]
[null,"a",{"$f":"($C$5-$D$5)/($C$4-$D$4)","v":0.71821507839916809},{"$f":"($C$5-$D$5)/($C$4-$D$4)","v":0.71821507839916809},{"$f":"D7","v":0.71821507839916809}]
[]
[null,null,4282,4915,{"$f":"VLOOKUP(1353,'Выгрузка с сайта'!$A:$E,5,0)","v":7011}]
[null,null,30,2819,{"$f":"VLOOKUP($A$12,'Выгрузка с сайта'!$C:$E,3,0)","v":61}]
[null,"х",{"$f":" 1 - C10/C9","v":0.99299392807099485},{"$f":" 1 - D10/D9","v":0.42644964394710072},{"$f":" 1 - E10/E9","v":0.99129938667807727}]
["Кит Горбатый","у",1.0918462662952506,0.61343206646451676,{"$f":"E14*E11+E13","v":1.0904153231416605}]
[null,"b",{"$f":"C12-C14*C11","v":0.25331976651862631},{"$f":"D12-D14*D11","v":0.25331976651862631},{"$f":"D13","v":0.25331976651862631}]
[null,"a",{"$f":"($C$12-$D$12)/($C$11-$D$11)","v":0.84444272625670402},{"$f":"($C$12-$D$12)/($C$11-$D$11)","v":0.84444272625670402},{"$f":"D14","v":0.84444272625670402}]
[]
[null,1289,12730,4915,{"$f":"VLOOKUP(1353,'Выгрузка с сайта'!$A:$E,5,0)","v":7011}]
[null,null,58,1143,{"$f":"VLOOKUP($A$19,'Выгрузка с сайта'!$C:$E,3,0)","v":49}]
[null,"х",{"$f":" 1 - C17/C16","v":0.99544383346425769},{"$f":" 1 - D17/D16","v":0.76744659206510679},{"$f":" 1 - E17/E16","v":0.99301098274140631}]
["Кит синий северный","у",1.4393780101620015,1.1860464077026547,{"$f":"E21*E18+E20","v":1.4366748284551432}]
[null,"b",{"$f":"C19-C21*C18","v":0.3333234809833221},{"$f":"D19-D21*D18","v":0.33332348098332198},{"$f":"D20","v":0.33332348098332198}]
[null,"a",{"$f":"($C$19-$D$19)/($C$18-$D$18)","v":1.1111169631032662},{"$f":"($C$19-$D$19)/($C$18-$D$18)","v":1.1111169631032662},{"$f":"D21","v":1.1111169631032662}]
[]
[null,null,4282,4915,{"$f":"VLOOKUP(1353,'Выгрузка с сайта'!$A:$E,5,0)","v":7011}]
[null,null,151,652,{"$f":"VLOOKUP($A$26,'Выгрузка с сайта'!$C:$E,3,0)","v":143}]
[null,"х",{"$f":" 1 - C24/C23","v":0.9647361046240075},{"$f":" 1 - D24/D23","v":0.8673448626653103},{"$f":" 1 - E24/E23","v":0.97960348024532873}]
["Кашалот","у",1.0199457510417711,0.94140077880703943,{"$f":"E28*E25+E27","v":1.0319361269923646}]
[null,"b",{"$f":"C26-C28*C25","v":0.24189662642262444},{"$f":"D26-D28*D25","v":0.24189662642262444},{"$f":"D27","v":0.24189662642262444}]
[null,"a",{"$f":"($C$26-$D$26)/($C$25-$D$25)","v":0.8064890708349518},{"$f":"($C$26-$D$26)/($C$25-$D$25)","v":0.8064890708349518},{"$f":"D28","v":0.8064890708349518}]
[]
[null,null,12730,4915,{"$f":"VLOOKUP(1353,'Выгрузка с сайта'!$A:$E,5,0)","v":7011}]
[null,null,52,455,{"$f":"VLOOKUP($A$33,'Выгрузка с сайта'!$C:$E,3,0)","v":12}]
[null,"х",{"$f":" 1 - C31/C30","v":0.99591516103692068},{"$f":" 1 - D31/D30","v":0.90742624618514756},{"$f":" 1 - E31/E30","v":0.99828840393667095}]
["Кит горбатый-альбинос","у",1.72785708885921,1.6098661823686109,{"$f":"E35*E32+E34","v":1.7310215652406074}]
[null,"b",{"$f":"C33-C35*C32","v":0.39990620557269629},{"$f":"D33-D35*D32","v":0.39990620557269629},{"$f":"D34","v":0.39990620557269629}]
[null,"a",{"$f":"($C$33-$D$33)/($C$32-$D$32)","v":1.3333975977470673},{"$f":"($C$33-$D$33)/($C$32-$D$32)","v":1.3333975977470673},{"$f":"D35","v":1.3333975977470673}]
[]
[null,null,12730,4915,{"$f":"VLOOKUP(1353,'Выгрузка с сайта'!$A:$E,5,0)","v":7011}]
[null,null,13,16,{"$f":"VLOOKUP($A$40,'Выгрузка с сайта'!$C:$E,3,0)","v":2}]
[null,"х",{"$f":" 1 - C38/C37","v":0.9989787902592302},{"$f":" 1 - D38/D37","v":0.99674465920651067},{"$f":" 1 - E38/E37","v":0.9997147339894451}]
["Кит серый","у",0.952566527000136,0.95092123799865036,{"$f":"E42*E39+E41","v":0.95310850063393915}]
[null,"b",{"$f":"C40-C42*C39","v":0.21688505731632424},{"$f":"D40-D42*D39","v":0.21688505731632424},{"$f":"D41","v":0.21688505731632424}]
[null,"a",{"$f":"($C$40-$D$40)/($C$39-$D$39)","v":0.73643352277069463},{"$f":"($C$40-$D$40)/($C$39-$D$39)","v":0.73643352277069463},{"$f":"D42","v":0.73643352277069463}]
[]
[null,null,12730,4915,{"$f":"VLOOKUP(1353,'Выгрузка с сайта'!$A:$E,5,0)","v":7011}]
[null,null,23,303,{"$f":"VLOOKUP($A$47,'Выгрузка с сайта'!$C:$E,3,0)","v":11}]
[null,"х",{"$f":" 1 - C45/C44","v":0.99819324430479184},{"$f":" 1 - D45/D44","v":0.93835198372329609},{"$f":" 1 - E45/E44","v":0.99843103694194835}]
["Кит японский","у",2.1636521239056639,2.0639128574312569,{"$f":"E49*E46+E48","v":2.1640484601955841}]
[null,"b",{"$f":"C47-C49*C46","v":0.49993279347674613},{"$f":"D47-D49*D46","v":0.49993279347674613},{"$f":"D48","v":0.49993279347674613}]
[null,"a",{"$f":"($C$47-$D$47)/($C$46-$D$46)","v":1.6667307056236815},{"$f":"($C$47-$D$47)/($C$46-$D$46)","v":1.6667307056236815},{"$f":"D49","v":1.6667307056236815}]
[]
[null,null,12730,4915,{"$f":"VLOOKUP(1353,'Выгрузка с сайта'!$A:$E,5,0)","v":7011}]
[null,null,199,117,{"$f":"VLOOKUP($A$54,'Выгрузка с сайта'!$C:$E,3,0)","v":67}]
[null,"х",{"$f":" 1 - C52/C51","v":0.98436763550667716},{"$f":" 1 - D52/D51","v":0.97619532044760937},{"$f":" 1 - E52/E51","v":0.9904435886464128}]
["Сейвал или кит ивасевый","у",0.61007123665853236,0.60618136174091253,{"$f":"E56*E53+E55","v":0.61296328102393738}]
[null,"b",{"$f":"C54-C56*C53","v":0.14152995461073287},{"$f":"D54-D56*D53","v":0.14152995461073287},{"$f":"D55","v":0.14152995461073287}]
[null,"a",{"$f":"($C$54-$D$54)/($C$53-$D$53)","v":0.47598200626194936},{"$f":"($C$54-$D$54)/($C$53-$D$53)","v":0.47598200626194936},{"$f":"D56","v":0.47598200626194936}]