{"text_format":"1","workbook":"xlsx","n_sheets":4,"sheets":["Кэфы","Выгрузка с сайта","Выгрузка","Вычисления"],"not_rendered":{"charts":0,"images":1,"macros":1,"external_links":0,"defined_names":2,"comments":0,"pivot_tables":0},"unopened":[],"bounds":{"document_bytes":16777216,"sheet_cells":100000,"rows_first":2000,"rows_last":500,"rows_between":2000,"halvings":0,"cell_chars":16384,"cell_head_chars":4096},"cells_cut":0,"cells_raw":0,"read":"whole","date_system":"1900"}

{"sheet":"Кэфы","index":0,"n_rows":25,"n_cols":6,"rows_kept":25,"cut":false,"hidden":false,"merged":[[15,1,18,5]]}
[]
[]
[]
[null,"До следующего обновления цен на рыбу осталось:",null,null,{"$f":"HOUR(TEXT(IF(TEXT(MID(INDEX(Выгрузка!$A:$A,MATCH(\"Последнее изменение цен было в *\",Выгрузка!$A:$A,0),1),32,5)*1+5/24,\"ч:мм\")*1-(NOW()-TODAY())<0, TEXT(MID(INDEX(Выгрузка!$A:$A,MATCH(\"Последнее изменение цен было в *\",Выгрузка!$A:$A,0),1),32,5)*1+5/24,\"ч:мм\")*1-(NOW()-TODAY())+1,TEXT(MID(INDEX(Выгрузка!$A:$A,MATCH(\"Последнее изменение цен было в *\",Выгрузка!$A:$A,0),1),32,5)*1+5/24,\"ч:мм\")*1-(NOW()-TODAY())),\"ч:мм\"))&\"ч \"&MINUTE(TEXT(IF(TEXT(MID(INDEX(Выгрузка!$A:$A,MATCH(\"Последнее изменение цен было в *\",Выгрузка!$A:$A,0),1),32,5)*1+5/24,\"ч:мм\")*1-(NOW()-TODAY())<0, TEXT(MID(INDEX(Выгрузка!$A:$A,MATCH(\"Последнее изменение цен было в *\",Выгрузка!$A:$A,0),1),32,5)*1+5/24,\"ч:мм\")*1-(NOW()-TODAY())+1,TEXT(MID(INDEX(Выгрузка!$A:$A,MATCH(\"Последнее изменение цен было в *\",Выгрузка!$A:$A,0),1),32,5)*1+5/24,\"ч:мм\")*1-(NOW()-TODAY())),\"ч:мм\"))&\"мин\"","v":"2ч 0мин"},"реального времени"]
[]
[null,"Кит","Шт.","Текущий кэф","Макс. кэф","% от макс.*"]
[null,"Кашалот",{"$f":"INDEX(Вычисления!$1:$1048576,MATCH($B7,Вычисления!$A:$A,0)-2,5)","v":510},{"$f":"IF(C7<=10, \"Баг с ценой\", VLOOKUP(B7,Вычисления!$A:$E,5,0))","v":0.81825289620895802},{"$f":"VLOOKUP(B7,Вычисления!$A:$F,6,0)","v":0.83876515976174448},{"$f":"IF(D7=\"Баг с ценой\", \"Не продавай!\",D7/E7)","v":0.9755446881477372}]
[null,"Кит горбатый",{"$f":"INDEX(Вычисления!$1:$1048576,MATCH($B8,Вычисления!$A:$A,0)-2,5)","v":201},{"$f":"IF(C8<=10, \"Баг с ценой\", VLOOKUP(B8,Вычисления!$A:$E,5,0))","v":1.0872174512757282},{"$f":"VLOOKUP(B8,Вычисления!$A:$F,6,0)","v":1.0977624927753302},{"$f":"IF(D8=\"Баг с ценой\", \"Не продавай!\",D8/E8)","v":0.99039405921681445}]
[null,"Кит горбатый-альбинос",{"$f":"INDEX(Вычисления!$1:$1048576,MATCH($B9,Вычисления!$A:$A,0)-2,5)","v":186},{"$f":"IF(C9<=10, \"Баг с ценой\", VLOOKUP(B9,Вычисления!$A:$E,5,0))","v":1.7178955060296943},{"$f":"VLOOKUP(B9,Вычисления!$A:$F,6,0)","v":1.7333038033197636},0.99111044626997413]
[null,"Кит синий северный",{"$f":"INDEX(Вычисления!$1:$1048576,MATCH($B10,Вычисления!$A:$A,0)-2,5)","v":145},{"$f":"IF(C10<=10, \"Баг с ценой\", VLOOKUP(B10,Вычисления!$A:$E,5,0))","v":1.4344310032534637},{"$f":"VLOOKUP(B10,Вычисления!$A:$F,6,0)","v":1.4444404440865881},0.99307036792406211]
[null,"Кит серый",{"$f":"INDEX(Вычисления!$1:$1048576,MATCH($B11,Вычисления!$A:$A,0)-2,5)","v":13},{"$f":"IF(C11<=10, \"Баг с ценой\", VLOOKUP(B11,Вычисления!$A:$E,5,0))","v":0.95272379655098383},{"$f":"VLOOKUP(B11,Вычисления!$A:$F,6,0)","v":0.95331858008701886},0.99937609153072338]
[null,"Кит японский",{"$f":"INDEX(Вычисления!$1:$1048576,MATCH($B12,Вычисления!$A:$A,0)-2,5)","v":320},{"$f":"IF(C12<=10, \"Баг с ценой\", VLOOKUP(B12,Вычисления!$A:$E,5,0))","v":2.1335276997838535},{"$f":"VLOOKUP(B12,Вычисления!$A:$F,6,0)","v":2.1666634991004274},0.98470653180323964]
[null,"Сейвал или кит ивасевый",{"$f":"INDEX(Вычисления!$1:$1048576,MATCH($B13,Вычисления!$A:$A,0)-2,5)","v":106},{"$f":"IF(C13<=10, \"Баг с ценой\", VLOOKUP(B13,Вычисления!$A:$E,5,0))","v":0.614377387521305},{"$f":"VLOOKUP(B13,Вычисления!$A:$F,6,0)","v":0.61751196087268223},0.99492386617589179]
[null,"Финвал",{"$f":"INDEX(Вычисления!$1:$1048576,MATCH($B14,Вычисления!$A:$A,0)-2,5)","v":5222},{"$f":"IF(C14<=10, \"Баг с ценой\", VLOOKUP(B14,Вычисления!$A:$E,5,0))","v":0.75380366565884604},{"$f":"VLOOKUP(B14,Вычисления!$A:$F,6,0)","v":1.0045350644866518},0.75040055077028378]
[]
[null,"* Показывает в %, насколько текущая цена велика в сравнении с максимальной известной мне. Условные обозначения в виде стрелок и соответствующие значения описаны под таблицей. Изучи их и прими решение о продаже самостоятельно или в соответствии с рекомендациями."]
[]
[]
[]
[]
[null,"[98% - 100%] Смело продавай, прекрасная цена"]
[null,"[95% - 98%] Тоже отличная цена, но нередко бывает лучше"]
[null,"[90% - 95%] Средняя цена. Лучше придержи и продай позже"]
[null,"[80% - 90%] Плохая цена. Продавай, только если срочно нужны деньги"]
[null,"Ниже 80% Рыба не в цене. Ни в коем случае не продавай"]

{"sheet":"Выгрузка с сайта","index":1,"n_rows":1465,"n_cols":5,"rows_kept":1465,"cut":false,"hidden":true,"merged":[]}
["Место:","Рыба:","Рыба:2","Прогресс:","Продано (шт):"]
[1,"","Форель Бива","",0]
[2,"","Полосатик Омуры","",0]
[4,"","Сельдь атлантическая","",0]
[5,"","Вьюн амурский","",0]
[6,"","Каранкс бронзовый","",0]
[7,"","Морская свинья обыкновенная","",0]
[8,"","Кит южный гладкий","",0]
[9,"","Каранкс Гебера","",0]
[10,"","Кинжалозуб","",0]
[11,"","Бэрардиус Бэрда","",0]
[12,"","Акула мозамбикская бычья","",0]
[13,"","Морская свинья бесперая","",0]
[14,"","Рыба луна короткая","",0]
[15,"","Косаткодельфин","",0]
[16,"","Пузанок северокаспийский","",0]
[17,"","Сельдь тихоокеанская","",0]
[18,"","Сельдь волжская","",0]
[19,"","Менхэден бразильский","",0]
[20,"","Сельдь чёшско-печорская","",0]
[21,"","Эолидия","",0]
[23,"","Осетр корейский","",0]
[32,"","Кланкулюс","",0]
[33,"","Граммистес шестиполосый","",0]
[34,"","Чешуйчатник","",0]
[35,"","Семапрохилодус","",0]
[36,"","Рыба-тряпка","",0]
[38,"","Тилозур красноморский","",0]
[41,"","Конус письменный","",0]
[42,"","Рыба-луна овальная","",0]
[43,"","Акула сигарная","",0]
[44,"","Акула скульптурная","",0]
[45,"","Акула - свинья","",0]
[46,"","Акула острозубая","",0]
[47,"","Акула светлохвостая","",0]
[48,"","Лихия","",0]
[49,"","Маллисквама","",0]
[50,"","Камбала двухцветная","",0]
[51,"","Акула шершавая","",0]
[52,"","Калкан черноморский","",0]
[53,"","Кижуч озерный","",0]
[55,"","Голец узонский","",0]
[59,"","Акула губастая","",0]
[60,"","Форель остроголовая","",0]
[62,"","Осетр тихоокеанский","",0]
[63,"","Минога сибирская","",0]
[64,"","Группер Малабарский","",0]
[65,"","Афалина","",0]
[66,"","Кит синий альбинос","",0]
[68,"","Осьминог Думбо","",0]
[69,"","Косатка малая","",0]
[70,"","Манта рифовая","",0]
[71,"","Антимора  клюворылая","",0]
[72,"","Ремнезуб командорский","",0]
[73,"","Осетр адриатический","",0]
[74,"","Плиотрема","",0]
[75,"","Сарпа","",0]
[76,"","Пилонос японский","",0]
[77,"","Палтус американский","",0]
[78,"","Австралийский пилонос","",0]
[80,"","Змея рисовая","",0]
[81,"","Центрина Австралийская","",0]
[82,"","Форель Дональдсона","",0]
[83,"","Хвостокол кольчатый","",0]
[84,"","Свистулька голубопятнистая","",0]
[89,"","Кит Бискайский","",0]
[90,"","Сферомия пятнистая","",0]
[91,"","Китовая акула - альбинос","",0]
[92,"","","",0]
[93,"","Тигровая рыба обыкновенная","",0]
[94,"","Мелания песчаная","",0]
[96,"","Лягушка нильская","",0]
[97,"","Сом жирафовый","",0]
[100,"","Крылатка-зебра","",0]
[101,"","Акула свиноглазая","",0]
[105,"","Принцесса Бурунди","",0]
[116,"","Кит Акишима","",0]
[117,"","Скафокогия","",0]
[119,"","Аулонокара Ньяса","",0]
[122,"","Королева Танганьики","",0]
[124,"","Королева Ньяса","",0]
[125,"","Фахака","",0]
[126,"","Конус березовый","",0]
[127,"","Конус дворцовый","",0]
[128,"","Крокодил нильский","",0]
[131,"","Конус текстильный","",0]
[133,"","Конус полосатый","",0]
[134,"","Конус Мильн-Эдвардса","",0]
[135,"","Конус мраморный","",0]
[146,"","Акула - квагга","",0]
[149,"","Карась-барабан","",0]
[150,"","Шипощёк длинноперый","",0]
[154,"","Мурена гигантская","",0]
[155,"","Скат-орляк пятнистый","",0]
[157,"","Синодонтис вуалевый","",0]
[158,"","Велифер","",0]
[159,"","Аба-аба","",0]
[160,"","Горгасия красноморская","",0]
[161,"","Линофрина индийская","",0]
[162,"","Рыба-кабан трехполосая","",0]
[163,"","Удильщик Джонсона","",0]
[164,"","Макрурус вооруженный","",0]
[165,"","Группер белоокаймленный","",0]
[166,"","Оксимонокант длиннорылый","",0]
[167,"","Зубатка синяя","",0]
[168,"","Креветка северная","",0]
[170,"","Волютопсиус каштановый","",0]
[171,"","Необерингиус Фрилея","",0]
[174,"","Краб вельветовый","",0]
[176,"","Ремнезуб атлантический","",0]
[178,"","Ампуллярия","",0]
[181,"","Хемиодопсис","",0]
[183,"","Серцевидка","",0]
[184,"","Морская свинья Далля","",0]
[185,"","Акула плоскоголовая","",0]
[187,"","Единорог расписной","",0]
[189,"","Рыбальдо","",0]
[191,"","Морская свинья аргентинская","",0]
[192,"","Нереис","",0]
[193,"","Буффало большеротый","",0]
[195,"","Венера воздушная","",0]
[197,"","Рапана Венозная","",0]
[198,"","Спинорог золотоплавниковый","",0]
[199,"","Глаукус","",0]
[201,"","Ликодонт яванский","",0]
[203,"","Бисса","",0]
[208,"","Уару","",0]
[209,"","Акарихтис Хекеля","",0]
[210,"","Анаконда","",0]
[211,"","Акара голубовато-пятнистая","",0]
[213,"","Кои Платинум Огон","",0]
[214,"","Гидромедуза бразильская","",0]
[215,"","Джакунда","",0]
[216,"","Биара","",0]
[218,"","Астронотус глаздчатый","",0]
[219,"","Скат мозаичный","",0]
[223,"","Осьминог обыкновенный","",0]
[224,"","Чоп","",0]
[225,"","Краб Мраморный","",0]
[226,"","Итальянский усач","",0]
[228,"","Усач Валецкого","",0]
[229,"","Дианема полосатохвостая","",0]
[230,"","Пиранья стройная","",0]
[231,"","Пирапитинга","",0]
[235,"","Тегу","",0]
[239,"","Таедо","",0]
[241,"","Лепоринус Фредерика","",0]
[242,"","Колоссома","",0]
[243,"","Дискус Хеккеля","",0]
[245,"","Павлиний окунь ленточный","",0]
[247,"","Милоссома килебрюхая","",0]
[248,"","Метиннис пятнистый","",0]
[249,"","Милеус ленточный","",0]
[250,"","Форель апачей","",0]
[251,"","Губка-лира","",0]
[252,"","Клюворыл Шепарда","",0]
[253,"","Ремнезуб перуанский","",0]
[254,"","Тауматихт Акселя","",0]
[255,"","Пирарара","",0]
[256,"","Скат акулохвостый","",0]
[257,"","Носорог пятнистый","",0]
[258,"","Матамата","",0]
[259,"","Лазианциструс","",0]
[261,"","Скат гладкий","",0]
[262,"","Саблезуб","",0]
[263,"","Макропинна","",0]
[264,"","Рыба-капля","",0]
[265,"","Пиранья крапчатая","",0]
[266,"","Акула Мицукури","",0]
[267,"","Черный нож","",0]
[269,"","Алепизавр","",0]
[270,"","Пайара","",0]
[271,"","Катран вануатский","",0]
[272,"","Багре хигучи","",0]
[273,"","Рыба-ремень, сельдяной король","",0]
[274,"","Акула черная (Далатия)","",0]
[275,"","Краб-йети","",0]
[276,"","Мегалодон","",0]
[277,"","Голец дальнеозерский","",0]
[278,"","Хирург-Ахиллес","",0]
[279,"","Акула эполетовая","",0]
[280,"","Мешкорот","",0]
[281,"","Галаксия чилийская","",0]
[282,"","Чешуеед,  Плагиотрем чешуеедный","",0]
[283,"","Рыба-сабля","",0]
[284,"","Акула плащеносная","",0]
[285,"","Жемчужная рыба","",0]
[286,"","Акула светящаяся","",0]
[287,"","Акулеола черная","",0]
[288,"","Акула-домовой","",0]
[289,"","Кайман широкомордый","",0]
[290,"","Кои Асаги","",0]
[291,"","Бельдюга Андрияшева","",0]
[293,"","","",0]
[294,"","Костерь","",0]
[296,"","","",0]
[297,"","","",0]
[298,"","","",0]
[299,"","","",0]
[300,"","","",0]
{"$rows_left_out":1266}
{"sheet":"Выгрузка","index":2,"n_rows":1565,"n_cols":5,"rows_kept":1565,"cut":false,"hidden":true,"merged":[]}
["Серверы"]
["Вход или регистрация"]
["Войти Регистрация Забыли пароль? Не пришел пароль?"]
["Загрузить"]
["Загрузить игру"]
["Обои на рабочий стол"]
["Новости"]
["Турниры"]
["Регулярные турниры"]
["Big Game Fishing"]
["Рейтинги"]
["Рейтинги игроков"]
["Таблица рекордов"]
["Командный турнирный рейтинг"]
["Командный дуэльный рейтинг"]
["Справочник"]
["Статистика сервера"]
["Цены на рыбу"]
["Список рыбы"]
["Список предметов"]
["Список водоемов"]
["Вопросы и ответы"]
["Мобильная версия"]
["Загрузить игру МРР"]
["Помощь и советы МРР"]
["Таблица рекордов МРР"]
["Цены на рыбу МРР"]
["Карта сервера МРР"]
["Расписание турниров МРР"]
["Рейтинги игроков МРР"]
["Рейтинг команд МРР"]
["Разработка"]
["Сообщество"]
["Форум"]
["Социальные сети"]
["Главная »"]
["Цены на рыбу"]
[]
["Цены на рыбу"]
[]
["Стоимость рыбы меняется каждые 5 реальных часов. Чем больше продают данную рыбу, тем меньше она стоит."]
[]
["Ниже представлен спрос на рыбу в порядке убывания."]
["Последнее изменение цен было в 17:57 МСК."]
["Место:","Рыба:",null,"Прогресс:","Продано (шт):"]
[1,null,"Форель Бива",null,0]
[2,null,"Полосатик Омуры",null,0]
[3,null,"Кит северный гладкий",null,2]
[4,null,"Сельдь атлантическая",null,0]
[5,null,"Вьюн амурский",null,0]
[6,null,"Каранкс бронзовый",null,0]
[7,null,"Морская свинья обыкновенная",null,0]
[8,null,"Кит южный гладкий",null,0]
[9,null,"Каранкс Гебера",null,0]
[10,null,"Кинжалозуб",null,0]
[11,null,"Бэрардиус Бэрда",null,0]
[12,null,"Акула мозамбикская бычья",null,0]
[13,null,"Морская свинья бесперая",null,0]
[14,null,"Рыба луна короткая",null,0]
[15,null,"Косаткодельфин",null,0]
[16,null,"Пузанок северокаспийский",null,0]
[17,null,"Сельдь тихоокеанская",null,0]
[18,null,"Сельдь волжская",null,0]
[19,null,"Менхэден бразильский",null,0]
[20,null,"Сельдь чёшско-печорская",null,0]
[21,null,"Эолидия",null,0]
[22,null,"Поллимир Исидора",null,30]
[23,null,"Осетр корейский",null,0]
[24,null,"Акула рифовая",null,1]
[25,null,"Группер таувина",null,2]
[26,null,"Каранг золотой",null,4]
[27,null,"Убанги",null,10]
[28,null,"Тиляпия нильская",null,47]
[29,null,"Хемихромис-красавец",null,70]
[30,null,"Алеста",null,73]
[31,null,"Цитарина обыкновенная",null,39]
[32,null,"Кланкулюс",null,0]
[33,null,"Граммистес шестиполосый",null,0]
[34,null,"Чешуйчатник",null,0]
[35,null,"Семапрохилодус",null,0]
[36,null,"Рыба-тряпка",null,0]
[37,null,"Тунец скумбриевидный",null,34]
[38,null,"Тилозур красноморский",null,0]
[39,null,"Бычеглаз-хамрур",null,6]
[40,null,"Мурджан",null,46]
[41,null,"Конус письменный",null,0]
[42,null,"Рыба-луна овальная",null,0]
[43,null,"Акула сигарная",null,0]
[44,null,"Акула скульптурная",null,0]
[45,null,"Акула - свинья",null,0]
[46,null,"Акула острозубая",null,0]
[47,null,"Акула светлохвостая",null,0]
[48,null,"Лихия",null,0]
[49,null,"Маллисквама",null,0]
[50,null,"Камбала двухцветная",null,0]
[51,null,"Акула шершавая",null,0]
[52,null,"Калкан черноморский",null,0]
[53,null,"Кижуч озерный",null,0]
[54,null,"Корюшка озерная малоротая",null,44]
[55,null,"Голец узонский",null,0]
[56,null,"Голец длинноголовый",null,3]
[57,null,"Голец носатый",null,2]
[58,null,"Хариус Камчатский",null,14]
[59,null,"Акула губастая",null,0]
[60,null,"Форель остроголовая",null,0]
[61,null,"Нерка карликовая",null,1]
[62,null,"Осетр тихоокеанский",null,0]
[63,null,"Минога сибирская",null,0]
[64,null,"Группер Малабарский",null,0]
[65,null,"Афалина",null,0]
[66,null,"Кит синий альбинос",null,0]
[67,null,"Токсабрамис",null,2]
[68,null,"Осьминог Думбо",null,0]
[69,null,"Косатка малая",null,0]
[70,null,"Манта рифовая",null,0]
[71,null,"Антимора клюворылая",null,0]
[72,null,"Ремнезуб командорский",null,0]
[73,null,"Осетр адриатический",null,0]
[74,null,"Плиотрема",null,0]
[75,null,"Сарпа",null,0]
[76,null,"Пилонос японский",null,0]
[77,null,"Палтус американский",null,0]
[78,null,"Австралийский пилонос",null,0]
[79,null,"Семга Камчатская",null,1]
[80,null,"Змея рисовая",null,0]
[81,null,"Центрина Австралийская",null,0]
[82,null,"Форель Дональдсона",null,0]
[83,null,"Хвостокол кольчатый",null,0]
[84,null,"Свистулька голубопятнистая",null,0]
[85,null,"Скорпенопсис дьявольский",null,3]
[86,null,"Неалот",null,1]
[87,null,"Мена пятнистая",null,7]
[88,null,"Мурена перечная",null,1]
[89,null,"Кит Бискайский",null,0]
[90,null,"Сферомия пятнистая",null,0]
[91,null,"Китовая акула - альбинос",null,0]
[92,null,null,null,0]
[93,null,"Тигровая рыба обыкновенная",null,0]
[94,null,"Мелания песчаная",null,0]
[95,null,"Мормиропс угревидный",null,10]
[96,null,"Лягушка нильская",null,0]
[97,null,"Сом жирафовый",null,0]
[98,null,"Карп африканский",null,4]
[99,null,"Бородавчатка красноморская",null,1]
[100,null,"Крылатка-зебра",null,0]
[101,null,"Акула свиноглазая",null,0]
[102,null,"Полиптер",null,1]
[103,null,"Семутунду",null,9]
[104,null,"Аристохромис Кpucmu",null,12]
[105,null,"Принцесса Бурунди",null,0]
[106,null,"Псевдотрофеус Демасони",null,3]
[107,null,"Офтальмотиляпия носатая",null,14]
[108,null,"Лабидохромис Хонги",null,2]
[109,null,"Лаванда Мбуна",null,25]
[110,null,"Тиляпия красногрудая",null,28]
[111,null,"Тиляпия мозамбикская",null,2]
[112,null,"Фея перламутровая",null,26]
[113,null,"Сардина танганьикская",null,15]
[114,null,"Летрин длиннорылый",null,1]
[115,null,"Бычок краснозубый",null,17]
[116,null,"Кит Акишима",null,0]
[117,null,"Скафокогия",null,0]
[118,null,"Аулонокара Бенша",null,6]
[119,null,"Аулонокара Ньяса",null,0]
[120,null,"Лабеотрофеус обыкновенный",null,6]
[121,null,"Лабидохромис большой",null,12]
[122,null,"Королева Танганьики",null,0]
[123,null,"Клоун танганьикский",null,9]
[124,null,"Королева Ньяса",null,0]
[125,null,"Фахака",null,0]
[126,null,"Конус березовый",null,0]
[127,null,"Конус дворцовый",null,0]
[128,null,"Крокодил нильский",null,0]
[129,null,"Луциан горбатый",null,1]
[130,null,"Плоскоголов пятнистый",null,2]
[131,null,"Конус текстильный",null,0]
[132,null,"Вунду",null,9]
[133,null,"Конус полосатый",null,0]
[134,null,"Конус Мильн-Эдвардса",null,0]
[135,null,"Конус мраморный",null,0]
[136,null,"Башир",null,21]
[137,null,"Ящероголов красный",null,26]
[138,null,"Скат тэниура лимма",null,4]
[139,null,"Тиляпия галилейская",null,24]
[140,null,"Собачка речная",null,48]
[141,null,"Нильский окунь",null,5]
[142,null,"Тигровая рыба нильская",null,24]
[143,null,"Сом электрический",null,11]
[144,null,"Шильб полосатый",null,21]
[145,null,"Баяд",null,6]
[146,null,"Акула - квагга",null,0]
[147,null,"Луциан - Бохар",null,4]
[148,null,"Тунец индо-тихоокеанский",null,7]
[149,null,"Карась-барабан",null,0]
[150,null,"Шипощёк длинноперый",null,0]
[151,null,"Карась морской чернополосый",null,5]
[152,null,"Группер красноротый",null,1]
[153,null,"Протоптер мраморный",null,16]
[154,null,"Мурена гигантская",null,0]
[155,null,"Скат-орляк пятнистый",null,0]
{"$rows_left_out":1366}
{"sheet":"Вычисления","index":3,"n_rows":56,"n_cols":6,"rows_kept":56,"cut":false,"hidden":true,"merged":[]}
[]
[null,"Продано (нижняя строка)",16096,12734,{"$f":"VLOOKUP(MAX(Table_0[Место:]),'Выгрузка с сайта'!$A:$E,5,0)","v":16096}]
[null,"Продано (целевая рыба)",5222,614,{"$f":"VLOOKUP($A$5,'Выгрузка с сайта'!$C:$E,3,0)","v":5222}]
[null,"х",{"$f":" 1 - C3/C2","v":0.67557157057654083},{"$f":" 1 - D3/D2","v":0.95178262918171819},{"$f":" 1 - E3/E2","v":0.67557157057654083},1]
["Финвал","Кэф ( f(x) = ax + b)",0.75380366565884604,0.96727073208966918,{"$f":"E7*E4+E6","v":0.75380366565884604},{"$f":"F7*F4+F6","v":1.0045350644866518}]
[null,"b",{"$f":"C5-C7*C4","v":0.2316946593674708},{"$f":"D5-D7*D4","v":0.2316946593674708},{"$f":"D6","v":0.2316946593674708},{"$f":"E6","v":0.2316946593674708}]
[null,"a",{"$f":"($C$5-$D$5)/($C$4-$D$4)","v":0.77284040511918106},{"$f":"($C$5-$D$5)/($C$4-$D$4)","v":0.77284040511918106},{"$f":"D7","v":0.77284040511918106},{"$f":"E7","v":0.77284040511918106}]
[]
[null,"Продано (нижняя строка)",4282,4915,{"$f":"VLOOKUP(MAX(Table_0[Место:]),'Выгрузка с сайта'!$A:$E,5,0)","v":16096}]
[null,"Продано (целевая рыба)",30,2819,{"$f":"VLOOKUP($A$12,'Выгрузка с сайта'!$C:$E,3,0)","v":201}]
[null,"х",{"$f":" 1 - C10/C9","v":0.99299392807099485},{"$f":" 1 - D10/D9","v":0.42644964394710072},{"$f":" 1 - E10/E9","v":0.9875124254473161},1]
["Кит Горбатый","Кэф ( f(x) = ax + b)",1.0918462662952506,0.61343206646451676,{"$f":"E14*E11+E13","v":1.0872174512757282},{"$f":"F14*F11+F13","v":1.0977624927753302}]
[null,"b",{"$f":"C12-C14*C11","v":0.25331976651862631},{"$f":"D12-D14*D11","v":0.25331976651862631},{"$f":"D13","v":0.25331976651862631},{"$f":"E13","v":0.25331976651862631}]
[null,"a",{"$f":"($C$12-$D$12)/($C$11-$D$11)","v":0.84444272625670402},{"$f":"($C$12-$D$12)/($C$11-$D$11)","v":0.84444272625670402},{"$f":"D14","v":0.84444272625670402},{"$f":"E14","v":0.84444272625670402}]
[]
[null,"Продано (нижняя строка)",12730,4915,{"$f":"VLOOKUP(MAX(Table_0[Место:]),'Выгрузка с сайта'!$A:$E,5,0)","v":16096}]
[null,"Продано (целевая рыба)",58,1143,{"$f":"VLOOKUP($A$19,'Выгрузка с сайта'!$C:$E,3,0)","v":145}]
[null,"х",{"$f":" 1 - C17/C16","v":0.99544383346425769},{"$f":" 1 - D17/D16","v":0.76744659206510679},{"$f":" 1 - E17/E16","v":0.99099155069582501},1]
["Кит синий северный","Кэф ( f(x) = ax + b)",1.4393780101620015,1.1860464077026547,{"$f":"E21*E18+E20","v":1.4344310032534637},{"$f":"F21*F18+F20","v":1.4444404440865881}]
[null,"b",{"$f":"C19-C21*C18","v":0.3333234809833221},{"$f":"D19-D21*D18","v":0.33332348098332198},{"$f":"D20","v":0.33332348098332198},{"$f":"E20","v":0.33332348098332198}]
[null,"a",{"$f":"($C$19-$D$19)/($C$18-$D$18)","v":1.1111169631032662},{"$f":"($C$19-$D$19)/($C$18-$D$18)","v":1.1111169631032662},{"$f":"D21","v":1.1111169631032662},{"$f":"E21","v":1.1111169631032662}]
[]
[null,"Продано (нижняя строка)",16096,12734,{"$f":"VLOOKUP(MAX(Table_0[Место:]),'Выгрузка с сайта'!$A:$E,5,0)","v":16096}]
[null,"Продано (целевая рыба)",510,340,{"$f":"VLOOKUP($A$26,'Выгрузка с сайта'!$C:$E,3,0)","v":510}]
[null,"х",{"$f":" 1 - C24/C23","v":0.96831510934393639},{"$f":" 1 - D24/D23","v":0.97329982723417618},{"$f":" 1 - E24/E23","v":0.96831510934393639},1]
["Кашалот","Кэф ( f(x) = ax + b)",0.81825289620895802,0.82147991845785195,{"$f":"E28*E25+E27","v":0.81825289620895802},{"$f":"F28*F25+F27","v":0.83876515976174448}]
[null,"b",{"$f":"C26-C28*C25","v":0.19138203398595699},{"$f":"D26-D28*D25","v":0.19138203398595699},{"$f":"D27","v":0.19138203398595699},{"$f":"E27","v":0.19138203398595699}]
[null,"a",{"$f":"($C$26-$D$26)/($C$25-$D$25)","v":0.64738312577578749},{"$f":"($C$26-$D$26)/($C$25-$D$25)","v":0.64738312577578749},{"$f":"D28","v":0.64738312577578749},{"$f":"E28","v":0.64738312577578749}]
[]
[null,"Продано (нижняя строка)",12730,4915,{"$f":"VLOOKUP(MAX(Table_0[Место:]),'Выгрузка с сайта'!$A:$E,5,0)","v":16096}]
[null,"Продано (целевая рыба)",52,455,{"$f":"VLOOKUP($A$33,'Выгрузка с сайта'!$C:$E,3,0)","v":186}]
[null,"х",{"$f":" 1 - C31/C30","v":0.99591516103692068},{"$f":" 1 - D31/D30","v":0.90742624618514756},{"$f":" 1 - E31/E30","v":0.98844433399602383},1]
["Кит горбатый-альбинос","Кэф ( f(x) = ax + b)",1.72785708885921,1.6098661823686109,{"$f":"E35*E32+E34","v":1.7178955060296943},{"$f":"F35*F32+F34","v":1.7333038033197636}]
[null,"b",{"$f":"C33-C35*C32","v":0.39990620557269629},{"$f":"D33-D35*D32","v":0.39990620557269629},{"$f":"D34","v":0.39990620557269629},{"$f":"E34","v":0.39990620557269629}]
[null,"a",{"$f":"($C$33-$D$33)/($C$32-$D$32)","v":1.3333975977470673},{"$f":"($C$33-$D$33)/($C$32-$D$32)","v":1.3333975977470673},{"$f":"D35","v":1.3333975977470673},{"$f":"E35","v":1.3333975977470673}]
[]
[null,"Продано (нижняя строка)",12730,4915,{"$f":"VLOOKUP(MAX(Table_0[Место:]),'Выгрузка с сайта'!$A:$E,5,0)","v":16096}]
[null,"Продано (целевая рыба)",13,16,{"$f":"VLOOKUP($A$40,'Выгрузка с сайта'!$C:$E,3,0)","v":13}]
[null,"х",{"$f":" 1 - C38/C37","v":0.9989787902592302},{"$f":" 1 - D38/D37","v":0.99674465920651067},{"$f":" 1 - E38/E37","v":0.99919234592445327},1]
["Кит серый","Кэф ( f(x) = ax + b)",0.952566527000136,0.95092123799865036,{"$f":"E42*E39+E41","v":0.95272379655098383},{"$f":"F42*F39+F41","v":0.95331858008701886}]
[null,"b",{"$f":"C40-C42*C39","v":0.21688505731632424},{"$f":"D40-D42*D39","v":0.21688505731632424},{"$f":"D41","v":0.21688505731632424},{"$f":"E41","v":0.21688505731632424}]
[null,"a",{"$f":"($C$40-$D$40)/($C$39-$D$39)","v":0.73643352277069463},{"$f":"($C$40-$D$40)/($C$39-$D$39)","v":0.73643352277069463},{"$f":"D42","v":0.73643352277069463},{"$f":"E42","v":0.73643352277069463}]
[]
[null,"Продано (нижняя строка)",12730,4915,{"$f":"VLOOKUP(MAX(Table_0[Место:]),'Выгрузка с сайта'!$A:$E,5,0)","v":16096}]
[null,"Продано (целевая рыба)",23,303,{"$f":"VLOOKUP($A$47,'Выгрузка с сайта'!$C:$E,3,0)","v":320}]
[null,"х",{"$f":" 1 - C45/C44","v":0.99819324430479184},{"$f":" 1 - D45/D44","v":0.93835198372329609},{"$f":" 1 - E45/E44","v":0.98011928429423456},1]
["Кит японский","Кэф ( f(x) = ax + b)",2.1636521239056639,2.0639128574312569,{"$f":"E49*E46+E48","v":2.1335276997838535},{"$f":"F49*F46+F48","v":2.1666634991004274}]
[null,"b",{"$f":"C47-C49*C46","v":0.49993279347674613},{"$f":"D47-D49*D46","v":0.49993279347674613},{"$f":"D48","v":0.49993279347674613},{"$f":"E48","v":0.49993279347674613}]
[null,"a",{"$f":"($C$47-$D$47)/($C$46-$D$46)","v":1.6667307056236815},{"$f":"($C$47-$D$47)/($C$46-$D$46)","v":1.6667307056236815},{"$f":"D49","v":1.6667307056236815},{"$f":"E49","v":1.6667307056236815}]
[]
[null,"Продано (нижняя строка)",12730,4915,{"$f":"VLOOKUP(MAX(Table_0[Место:]),'Выгрузка с сайта'!$A:$E,5,0)","v":16096}]
[null,"Продано (целевая рыба)",199,117,{"$f":"VLOOKUP($A$54,'Выгрузка с сайта'!$C:$E,3,0)","v":106}]
[null,"х",{"$f":" 1 - C52/C51","v":0.98436763550667716},{"$f":" 1 - D52/D51","v":0.97619532044760937},{"$f":" 1 - E52/E51","v":0.99341451292246519},1]
["Сейвал или кит ивасевый","Кэф ( f(x) = ax + b)",0.61007123665853236,0.60618136174091253,{"$f":"E56*E53+E55","v":0.614377387521305},{"$f":"F56*F53+F55","v":0.61751196087268223}]
[null,"b",{"$f":"C54-C56*C53","v":0.14152995461073287},{"$f":"D54-D56*D53","v":0.14152995461073287},{"$f":"D55","v":0.14152995461073287},{"$f":"E55","v":0.14152995461073287}]
[null,"a",{"$f":"($C$54-$D$54)/($C$53-$D$53)","v":0.47598200626194936},{"$f":"($C$54-$D$54)/($C$53-$D$53)","v":0.47598200626194936},{"$f":"D56","v":0.47598200626194936},{"$f":"E56","v":0.47598200626194936}]